Phenol, 2,4,6-trimethyl-
- Formula: C9H12O
- Molecular weight: 136.1910
- IUPAC Standard InChIKey: BPRYUXCVCCNUFE-UHFFFAOYSA-N
- CAS Registry Number: 527-60-6
- Chemical structure:
View 3d structure (requires JavaScript / HTML 5) - Other names: Mesitol; Mesityl alcohol; 1-Hydroxy-2,4,6-trimethylbenzene; 2-Hydroxymesitylene; 2,4,6-Trimethylphenol; 2,4,6-Trimetylofenol

Gas phase thermochemistry data

Data compiled as indicated in comments:
DRB - Donald R. Burgess, Jr.
ALS - Hussein Y. Afeefy, Joel F. Liebman, and Stephen E. Stein
Quantity | Value | Units | Method | Reference | Comment |
---|---|---|---|---|---|
ΔfH°gas | -263.7 | kJ/mol | N/A | Khodzhaeva, Iskhakova, et al., 1991 | Value computed using ΔfHsolid° value of -356.8 kj/mol from Khodzhaeva, Iskhakova, et al., 1991 and ΔsubH° value of 93.1 kj/mol from Bertholon, Giray, et al., 1971.; DRB |
ΔfH°gas | -176.9 | kJ/mol | Ccb | Bertholon, Giray, et al., 1971 | ALS |

Condensed phase thermochemistry data

Data compiled as indicated in comments:
ALS - Hussein Y. Afeefy, Joel F. Liebman, and Stephen E. Stein
DH - Eugene S. Domalski and Elizabeth D. Hearing
Quantity | Value | Units | Method | Reference | Comment |
---|---|---|---|---|---|
ΔfH°solid | Ccb | Khodzhaeva, Iskhakova, et al., 1991 | uncertain value: -356.84 kJ/mol; Undetermined error; ALS | ||
ΔfH°solid | -270. | kJ/mol | Ccb | Bertholon, Giray, et al., 1971 | ALS |
Quantity | Value | Units | Method | Reference | Comment |
ΔcH°solid | Ccb | Khodzhaeva, Iskhakova, et al., 1991 | uncertain value: -490. ± 62. kJ/mol; Undetermined error; ALS | ||
ΔcH°solid | -4983. | kJ/mol | Ccb | Bertholon, Giray, et al., 1971 | Corresponding ΔfHºsolid = -270. kJ/mol (simple calculation by NIST; no Washburn corrections); ALS |
Quantity | Value | Units | Method | Reference | Comment |
S°solid,1 bar | 215.13 | J/mol*K | N/A | Khodzhaeva, Iskhakova, et al., 1991 | DH |
Constant pressure heat capacity of solid
Cp,solid (J/mol*K) | Temperature (K) | Reference | Comment |
---|---|---|---|
213.12 | 298.15 | Khodzhaeva, Iskhakova, et al., 1991 | T = 90 to 320 K. Cp(c) = -460.08(T/100)-2 + 1250.90(T/100)-1 - 1258.35 + 682.09(T/100) - 138.79(T/100)2 + 11.79(T/100)3 J/mol*K.; DH |

Phase change data

Data compiled as indicated in comments:
BS - Robert L. Brown and Stephen E. Stein
TRC - Thermodynamics Research Center, NIST Boulder Laboratories, Chris Muzny director
AC - William E. Acree, Jr., James S. Chickos
ALS - Hussein Y. Afeefy, Joel F. Liebman, and Stephen E. Stein
DRB - Donald R. Burgess, Jr.
Quantity | Value | Units | Method | Reference | Comment |
---|---|---|---|---|---|
Tboil | 493.2 | K | N/A | Aldrich Chemical Company Inc., 1990 | BS |
Tboil | 494.15 | K | N/A | Hey, 1961 | Uncertainty assigned by TRC = 3. K; TRC |
Quantity | Value | Units | Method | Reference | Comment |
Tfus | 344. ± 3. | K | AVG | N/A | Average of 10 values; Individual data points |
Quantity | Value | Units | Method | Reference | Comment |
ΔsubH° | 82.8 ± 0.3 | kJ/mol | GS | Verevkin, 1999 | AC |
ΔsubH° | 95.0 | kJ/mol | C | Bertholon, Giray, et al., 1971, 2 | See also Verevkin, 1999.; AC |
ΔsubH° | 95.02 | kJ/mol | C | Bertholon, Giray, et al., 1971 | ALS |
ΔsubH° | 93.1 | kJ/mol | N/A | Bertholon, Giray, et al., 1971 | DRB |
Enthalpy of vaporization
ΔvapH (kJ/mol) | Temperature (K) | Method | Reference | Comment |
---|---|---|---|---|
53.2 | 382. | A | Stephenson and Malanowski, 1987 | Based on data from 367. to 494. K. See also von Terres, Gebert, et al., 1955.; AC |
Antoine Equation Parameters
log10(P) = A − (B / (T + C))
P = vapor pressure (bar)
T = temperature (K)
View plot Requires a JavaScript / HTML 5 canvas capable browser.
Temperature (K) | A | B | C | Reference | Comment |
---|---|---|---|---|---|
367. to 493.8 | 4.51555 | 1917.363 | -68.384 | von Terres, Gebert, et al., 1955, 2 | Coefficents calculated by NIST from author's data. |

Gas phase ion energetics data

Data compiled by: Sharon G. Lias, John E. Bartmess, Joel F. Liebman, John L. Holmes, Rhoda D. Levin, and W. Gary Mallard
Ionization energy determinations
IE (eV) | Method | Reference | Comment |
---|---|---|---|
8.00 | PE | Cetinkaya, Lappert, et al., 1983 | Vertical value |

Normal alkane RI, non-polar column, temperature ramp

Data compiled by: NIST Mass Spectrometry Data Center, William E. Wallace, director

Column type CapillaryCapillaryCapillaryCapillaryCapillary
Active phase DB-5DB-1DB-1HP-1Ultra-1
Column length (m) 30.60.60.30.25.
Carrier gas HeliumHeHeHeHe
Substrate
Column diameter (mm) 0.320.320.320.250.32
Phase thickness (μm) 0.250.250.250.10.25
Tstart (C) 40.35.35.50.80.
Tend (C) 250.230.230.300.260.
Heat rate (K/min) 8.2.2.5.3.
Initial hold (min) 2.4.4.2.
Final hold (min) 5.25.25.3.
I 1226.1171.1174.1184.1173.
ReferenceCzerny, Brueckner, et al., 2011Lee, Lee, et al., 2005Lee, Lee, et al., 2005Boatright and Crum, 1997Okumura, 1991
Comment MSDC-RI MSDC-RI MSDC-RI MSDC-RI MSDC-RI

Normal alkane RI, non-polar column, custom temperature program

Data compiled by: NIST Mass Spectrometry Data Center, William E. Wallace, director

Column type CapillaryCapillaryCapillaryCapillary
Active phase SE-30Polydimethyl siloxane, unknown content of Ph-groupsPolydimethyl siloxane, unknown content of Ph-groupsOV-1, SE-30, Methyl silicone, SP-2100, OV-101, DB-1, etc.
Column length (m)    50.
Carrier gas    Hydrogen
Substrate
Column diameter (mm)    0.32
Phase thickness (μm)
Program not specifiednot specifiednot specifiednot specified
I 1204.1204.1205.1204.
ReferencePeterson, 1992Geldon, 1989Geldon, 1989Waggott and Davies, 1984
Comment MSDC-RI MSDC-RI MSDC-RI MSDC-RI

Kovats' RI, non-polar column, custom temperature program

Data compiled by: NIST Mass Spectrometry Data Center, William E. Wallace, director

Column type Packed
Active phase SE-30
Column length (m) 2.9
Carrier gas
Substrate Chromosorb W HMDS (80-100 mesh)
Column diameter (mm)
Phase thickness (μm)
Program not specified
I 1204.
ReferenceGrzybowski, Lamparczyk, et al., 1980
Comment MSDC-RI

References

Khodzhaeva, Iskhakova, et al., 1991
Khodzhaeva, M.G.; Iskhakova, B.G.; Abdusalyamov, N.N.; Ismailov, T.S.,
Heat capacity and thermodynamics of 2,4,6-trimethylphenol,
Uzb. Khim. Zh., 1991, 27-29. [all data]
Bertholon, Giray, et al., 1971
Bertholon, G.; Giray, M.; Perrin, R.; Vincent-Falquet-Berny, M.F.,
No. 532. - Etude physicochimique des phenols. OX. - Ethanlpies de combustion et energies de resonance des alcoyl et aryphenols,
Bull. Soc. Chim. France, 1971, 3180-3187. [all data]
Aldrich Chemical Company Inc., 1990
Aldrich Chemical Company Inc.,
Catalog Handbook of Fine Chemicals, Aldrich Chemical Company, Inc., Milwaukee WI, 1990, 1. [all data]
Hey, 1961
Hey, D.H.,
J. Chem. Soc., 1961, 1961, 1581. [all data]
Verevkin, 1999
Verevkin, Sergey P.,
Thermochemistry of phenols: buttress effects in sterically hindered phenols,
The Journal of Chemical Thermodynamics, 1999, 31, 11, 1397-1416, https://doi.org/10.1006/jcht.1999.0466
. [all data]
Bertholon, Giray, et al., 1971, 2
Bertholon, G.; Giray, M.; Perrin, R.; Vincent-Falquet-Berny, M.F.,
Bull. Soc. Chim. Fr., 1971, 9, 3180. [all data]
Stephenson and Malanowski, 1987
Stephenson, Richard M.; Malanowski, Stanislaw,
Handbook of the Thermodynamics of Organic Compounds, 1987, https://doi.org/10.1007/978-94-009-3173-2
. [all data]
von Terres, Gebert, et al., 1955
von Terres, E.; Gebert, F.; Hulsemann, H.; Petereit, H.; Toepsch, H.; Ruppert, W.,
Brennst.-Chem., 1955, 36, 272. [all data]
von Terres, Gebert, et al., 1955, 2
von Terres, E.; Gebert, F.; Hulsemann, H.; Petereit, H.; Toepsch, H.; Ruppert, W.,
Zur Kenntnis der physikalisch-chemischen Grundlagen der Gewinnung und Zerlegung der Phenolfraktionen von Steinkohlenteer und Braunkohlenschwelteer. IV. Mitteilung Die Dampfdrucke von Phenol und Phenolderivaten,
Brennst.-Chem., 1955, 36, 272-274. [all data]
Cetinkaya, Lappert, et al., 1983
Cetinkaya, B.; Lappert, M.F.; Suffolk, R.J.,
Photoelectron spectra of some sterically hindered phenols and related compounds,
J. Chem. Res. Synop., 1983, 316. [all data]