Propane, 2-nitro-2-nitroso-
- Formula: C3H6N2O3
- Molecular weight: 118.0913
- IUPAC Standard InChIKey: MYRROMXOABKDLG-UHFFFAOYSA-N
- CAS Registry Number: 5275-46-7
- Chemical structure:
View 3d structure (requires JavaScript / HTML 5) - Permanent link for this species. Use this link for bookmarking this species for future reference.

Gas phase ion energetics data

Data compiled by: Sharon G. Lias, Rhoda D. Levin, and Sherif A. Kafafi
Ionization energy determinations
IE (eV) | Method | Reference | Comment |
---|---|---|---|
9.9 ± 0.1 | PE | Egdell, Green, et al., 1975 | Vertical value |
Appearance energy determinations
Ion | AE (eV) | Other Products | Method | Reference | Comment |
---|---|---|---|---|---|
CH3+ | 14.20 | ? | EI | Day, Gowenlock, et al., 1978 | |
CNO2+ | 10.15 | ? | EI | Day, Gowenlock, et al., 1978 | |
C2H3+ | 14.30 | ? | EI | Day, Gowenlock, et al., 1978 | |
C2H4NO+ | 10.15 | ? | EI | Day, Gowenlock, et al., 1978 | |
C2H5+ | 13.50 | ? | EI | Day, Gowenlock, et al., 1978 | |
C3H3+ | 14.05 | ? | EI | Day, Gowenlock, et al., 1978 | |
C3H4+ | 14.60 | ? | EI | Day, Gowenlock, et al., 1978 | |
C3H5+ | 11.40 | ? | EI | Day, Gowenlock, et al., 1978 | |
C3H6+ | 11.20 | ? | EI | Day, Gowenlock, et al., 1978 | |
C3H7+ | 11.40 | ? | EI | Day, Gowenlock, et al., 1978 | |
NO+ | 10.50 | ? | EI | Day, Gowenlock, et al., 1978 |

References

Egdell, Green, et al., 1975
Egdell, R.; Green, J.C.; Rao, C.N.R.; Gowenlock, B.G.; Pfab, J.,
He(I) photoelectron studies of C-nitroso compounds,
J. Chem. Soc. Faraday Trans. 2, 1975, 988. [all data]
Day, Gowenlock, et al., 1978
Day, J.S.; Gowenlock, B.G.; Johnson, C.A.F.; McInally, I.D.; Pfab, J.,
Appearance potential studies of some geminal substituted C-nitroso- compounds,
J. Chem. Soc. Perkin Trans. 2, 1978, 10, 1110. [all data]
Edwards and Tate, 1951
Edwards, W.R., Jr.; Tate, C.W.,
Anal. Chem., 1951, 23, 826. [all data]