Durohydroquinone
- Formula: C10H14O2
- Molecular weight: 166.2170
- IUPAC Standard InChIKey: SUNVJLYYDZCIIK-UHFFFAOYSA-N
- CAS Registry Number: 527-18-4
- Chemical structure:
View 3d structure (requires JavaScript / HTML 5) - Other names: Dihydroxydurene; Duro-p-hydroquinone; Hydroquinone, tetramethyl-; Tetramethylhydroquinone; 1,4-Benzenediol, 2,3,5,6-tetramethyl-; 2,3,5,6-Tetramethylhydroquinone

Gas phase ion energetics data

Data compiled by: Sharon G. Lias, Rhoda D. Levin, and Sherif A. Kafafi
Ionization energy determinations
IE (eV) | Method | Reference |
---|---|---|
7.48 ± 0.05 | PI | Potapov, Kardash, et al., 1972 |

References

Potapov, Kardash, et al., 1972
Potapov, V.K.; Kardash, I.E.; Sorokin, V.V.; Sokolov, S.A.; Evlasheva, T.I.,
Photoionization of heteroaromatic compounds,
Khim. Vys. Energ., 1972, 6, 392. [all data]