Spiro[2,4]hept-4-ene
- Formula: C7H10
- Molecular weight: 94.1543
- IUPAC Standard InChIKey: IAQUBQHHIIUMIT-UHFFFAOYSA-N
- CAS Registry Number: 52708-23-3
- Chemical structure:
View 3d structure (requires JavaScript / HTML 5) - Permanent link for this species. Use this link for bookmarking this species for future reference.

Gas phase ion energetics data

Data compiled as indicated in comments:
LLK - Sharon G. Lias, Rhoda D. Levin, and Sherif A. Kafafi
Ionization energy determinations
IE (eV) | Method | Reference | Comment |
---|---|---|---|
8.48 | PE | Bruckmann and Klessinger, 1974 | Vertical value; LLK |

References

Bruckmann and Klessinger, 1974
Bruckmann, P.; Klessinger, M.,
Photoelektronenspektren organischer verbindungen. V. Wechselwirkung kleiner ringe mit π-systemen,
Chem. Ber., 1974, 107, 1108. [all data]