1,5-Cyclooctadiene, (E,Z)-
- Formula: C8H12
- Molecular weight: 108.1809
- IUPAC Standard InChIKey: VYXHVRARDIDEHS-CDTWYVJESA-N
- CAS Registry Number: 5259-71-2
- Chemical structure:
View 3d structure (requires JavaScript / HTML 5) - Stereoisomers:
- Other names: cis,trans-1,5-Cyclooctadiene; (E),(Z)-1,5-Cyclooctadiene; (1Z,5E)-Cyclooctadiene

Gas phase thermochemistry data

Data compiled by: Hussein Y. Afeefy, Joel F. Liebman, and Stephen E. Stein
Quantity | Value | Units | Method | Reference | Comment |
---|---|---|---|---|---|
ΔfH°gas | 158. | kJ/mol | Chyd | Roth, Adamczak, et al., 1991 | |
ΔfH°gas | 162. | kJ/mol | Kin | Leitich, 1979 | |
ΔfH°gas | 156. | kJ/mol | Eqk | Martin, Kunze, et al., 1979 |

Reaction thermochemistry data

Data compiled by: Hussein Y. Afeefy, Joel F. Liebman, and Stephen E. Stein
Individual Reactions
By formula: 2H2 + C8H12 = C8H16
Quantity | Value | Units | Method | Reference | Comment |
---|---|---|---|---|---|
ΔrH° | -282. ± 0.4 | kJ/mol | Chyd | Roth, Adamczak, et al., 1991 | liquid phase |

Gas phase ion energetics data

Data compiled as indicated in comments:
LLK - Sharon G. Lias, Rhoda D. Levin, and Sherif A. Kafafi
Ionization energy determinations
IE (eV) | Method | Reference | Comment |
---|---|---|---|
8.2 | PE | Martin, Kunze, et al., 1979, 2 | LLK |
8.7 | PE | Martin, Kunze, et al., 1979, 2 | Vertical value; LLK |

References

Roth, Adamczak, et al., 1991
Roth, W.R.; Adamczak, O.; Breuckmann, R.; Lennartz, H.-W.; Boese, R.,
Die Berechnung von Resonanzenergien; das MM2ERW-Kraftfeld,
Chem. Ber., 1991, 124, 2499-2521. [all data]
Leitich, 1979
Leitich, J.,
Kinetics of the thermal dimerization and isomerization of cis,trans-1,5-cyclooctadiene in the gas phase and of related reactions. A simple algorithm to determine the rate constants of competing first- and second-order reactions,
Int. J. Chem. Kinet., 1979, 11, 1249-1261. [all data]
Martin, Kunze, et al., 1979
Martin, H.D.; Kunze, M.; Beckhaus, H.D.; Walsh, R.; Gleiter, R.,
Small rings. 33. cis,trans-1,5-cyclooctadiene: thermolysis, strain energy and transannular interactions,
Tetrahedron Lett., 1979, 3069-3072. [all data]
Martin, Kunze, et al., 1979, 2
Martin, H.-D.; Kunze, M.; Beckhaus, H.-D.; Walsh, R.; Gleiter, R.,
Cis, trans-1,5-Cyclooctadien Thermolyse, Spannungsenergie und transanulare Wechselwirkungen,
Tetrahedron Lett., 1979, 33, 3069. [all data]