Thiazyl bromide

Gas phase ion energetics data

Data compiled by: Sharon G. Lias and Joel F. Liebman

Ionization energy determinations

IE (eV) Method Reference Comment
10.2PEAllaf, Matti, et al., 1989
10.45PEAllaf, Matti, et al., 1989Vertical value

References

Allaf, Matti, et al., 1989
Allaf, A.W.; Matti, G.Y.; Suffolk, R.J.; Watts, J.D., Spectroscopic studies of thiazyl bromide, NSBr, J. Electron Spectrosc. Relat. Phenom., 1989, 48, 411. [all data]