2H-Pyran, 2-ethoxy-3,4-dihydro-6-methyl-
- Formula: C8H14O2
- Molecular weight: 142.1956
- IUPAC Standard InChIKey: ZEXJBQAOQUBOAP-UHFFFAOYSA-N
- CAS Registry Number: 52438-71-8
- Chemical structure:
View 3d structure (requires JavaScript / HTML 5) - Permanent link for this species. Use this link for bookmarking this species for future reference.

Gas phase ion energetics data

Data compiled as indicated in comments:
LBLHLM - Sharon G. Lias, John E. Bartmess, Joel F. Liebman, John L. Holmes, Rhoda D. Levin, and W. Gary Mallard
Ionization energy determinations
IE (eV) | Method | Reference | Comment |
---|---|---|---|
≤8.6 | PE | Morizur, Mercier, et al., 1982 | LBLHLM |

References

Morizur, Mercier, et al., 1982
Morizur, J.-P.; Mercier, J.; Sarraf, M.,
2-Substituted-2,3-dihydro-4H-pyrans: Competition between 'Retro Diels-Alder' fragmentation and substituent loss,
Org. Mass Spectrom., 1982, 17, 327. [all data]