Hydrazine, 1,2-di-tert-butyl 1,2-dimethyl-
- Formula: C10H24N2
- Molecular weight: 172.3110
- IUPAC Standard InChIKey: VATBYYOLJRJKRB-UHFFFAOYSA-N
- CAS Registry Number: 52291-46-0
- Chemical structure:
View 3d structure (requires JavaScript / HTML 5) - Permanent link for this species. Use this link for bookmarking this species for future reference.

Gas phase ion energetics data

Data compiled as indicated in comments:
LBLHLM - Sharon G. Lias, John E. Bartmess, Joel F. Liebman, John L. Holmes, Rhoda D. Levin, and W. Gary Mallard
LLK - Sharon G. Lias, Rhoda D. Levin, and Sherif A. Kafafi
Ionization energy determinations
IE (eV) | Method | Reference | Comment |
---|---|---|---|
7.93 | PE | Nelsen, 1984 | Vertical value; LBLHLM |
7.67 | PE | Nelsen, Peacock, et al., 1976 | Vertical value; LLK |
7.67 | PE | Rademacher, 1975 | Vertical value; LLK |
7.920 | PE | Nelsen and Buschek, 1974 | Vertical value; LLK |
7.67 | PE | Nelsen and Buschek, 1974, 2 | Vertical value; LLK |

References

Nelsen, 1984
Nelsen, S.F.,
Ionization from nitrogen and oxygen lone pairs: A comparison of trialkylamine, dialkyl ether, tetraalkylhydrazine, and dialkyl peroxide photoelectron spectroscopic ionization potentials,
J. Org. Chem., 1984, 49, 1891. [all data]
Nelsen, Peacock, et al., 1976
Nelsen, S.F.; Peacock, V.; Weisman, G.R.,
Single-electron oxidation equilibria of tetraalkylhydrazines. Comparison of solution E° values and vapor-phase ionization potentials,
J. Am. Chem. Soc., 1976, 98, 5269. [all data]
Rademacher, 1975
Rademacher, P.,
Acyclische Hydrazine,
Chem. Ber., 1975, 108, 1548. [all data]
Nelsen and Buschek, 1974
Nelsen, S.F.; Buschek, J.M.,
Photoelectron spectra of hydrazines. IV. Empirical estimation of lone pair-lone pair dihedral angles and prediction of lone pair ionization potentials for some cyclic and bicyclic hydrazines,
J. Am. Chem. Soc., 1974, 96, 6982. [all data]
Nelsen and Buschek, 1974, 2
Nelsen, S.F.; Buschek, J.M.,
Photoelectron spectra of hydrazines. III. Evidence for similar lone pair-lone pair dihedral angles for acyclic hydrazines,
J. Am. Chem. Soc., 1974, 96, 2392. [all data]