1H-Isoindole-1,3(2H)-dione, 2-phenyl-
- Formula: C14H9NO2
- Molecular weight: 223.2268
- IUPAC Standard InChIKey: MFUPLJQNEXUUDW-UHFFFAOYSA-N
- CAS Registry Number: 520-03-6
- Chemical structure:

Condensed phase thermochemistry data

Data compiled by: Eugene S. Domalski and Elizabeth D. Hearing
Quantity | Value | Units | Method | Reference | Comment |
---|---|---|---|---|---|
S°solid,1 bar | 273.0 | J/mol*K | N/A | Karyakin, Bazhan, et al., 1977 |
Constant pressure heat capacity of solid
Cp,solid (J/mol*K) | Temperature (K) | Reference | Comment |
---|---|---|---|
245.9 | 300. | Karyakin, Bazhan, et al., 1977 | T = 60 to 400 K. |

Phase change data

Data compiled by: Thermodynamics Research Center, NIST Boulder Laboratories, Chris Muzny director
Quantity | Value | Units | Method | Reference | Comment |
---|---|---|---|---|---|
Tfus | 490.4 | K | N/A | Kolev and Juchnovski, 1993 | Uncertainty assigned by TRC = 1.5 K |

Reaction thermochemistry data

Data compiled by: Hussein Y. Afeefy, Joel F. Liebman, and Stephen E. Stein
Individual Reactions
By formula: C14H11NO3 = C14H9NO2 + H2O
Quantity | Value | Units | Method | Reference | Comment |
---|---|---|---|---|---|
ΔrH° | -15. | kJ/mol | Eqk | Karyakin, Bazhan, et al., 1977, 2 | solid phase |

Gas phase ion energetics data

Data compiled as indicated in comments:
RDSH - Henry M. Rosenstock, Keith Draxl, Bruce W. Steiner, and John T. Herron
B - John E. Bartmess
Electron affinity determinations
EA (eV) | Method | Reference | Comment |
---|---|---|---|
1.153 ± 0.087 | IMRE | Paul and Kebarle, 1989 | ΔGea(423 K) = -25.4±1 kcal/mol, ΔS(est) = -3±3 eu; B |
Ionization energy determinations
IE (eV) | Method | Reference | Comment |
---|---|---|---|
8.8 | EI | Cotter and Dine-Hart, 1966 | RDSH |
Appearance energy determinations
Ion | AE (eV) | Other Products | Method | Reference | Comment |
---|---|---|---|---|---|
C13H9N+ | 11.0 | CO2 | EI | Cotter and Dine-Hart, 1966 | RDSH |

References

Karyakin, Bazhan, et al., 1977
Karyakin, N.V.; Bazhan, N.G.; Sapozhnikov, V.N.; Shvetsova, K.G.; Berestneva, G.L.; Lomteva, A.N.; Zimin, Yu.B.; Korshak, V.V.,
Thermodynamics of synthesis of poly-(p,p'-diphenylene oxide)pyromellitimide,
Vysokomol. Soedin., 1977, A19, 1541-1548. [all data]
Kolev and Juchnovski, 1993
Kolev, T.; Juchnovski, I.,
Vibrational assignment of N-phenylphthalimide and 15N-phenylphthalimide,
Spectrosc. Lett., 1993, 26, 207-25. [all data]
Karyakin, Bazhan, et al., 1977, 2
Karyakin, N.V.; Bazhan, N.G.; Sapozhnikov, V.N.; Shvetsova, K.G.; Berestneva, G.L.; Lomteva, A.N.; Zimin, Yu.B.; Korshak, V.V.,
Thermodynamics of synthesis of poly-(p,p'-diphenyleneoxide)pyromellitimide,
Polym. Sci. USSR, 1977, 19, 1766-1775. [all data]
Paul and Kebarle, 1989
Paul, G.; Kebarle, P.,
Electron Affinities of Cyclic Unsaturated Dicarbonyls: Maleic Anhydrides, Maleimides, and Cyclopentendione,
J. Am. Chem. Soc., 1989, 111, 2, 464, https://doi.org/10.1021/ja00184a009
. [all data]
Cotter and Dine-Hart, 1966
Cotter, J.L.; Dine-Hart, R.A.,
Ionization and dissociation of some aromatic imides under electron impact,
Chem. Commun., 1966, 809. [all data]