Dimolybdenum hexakis(dimethylamide)
- Formula: C12H36Mo2N6
- Molecular weight: 456.37
- CAS Registry Number: 51956-20-8

Condensed phase thermochemistry data

Data compiled by: José A. Martinho Simões
Quantity | Value | Units | Method | Reference | Comment |
---|---|---|---|---|---|
ΔfH°solid | 16.9 ± 9.4 | kJ/mol | Review | Martinho Simões |

Phase change data

Data compiled as indicated in comments:
AC - William E. Acree, Jr., James S. Chickos
MS - José A. Martinho Simões
Quantity | Value | Units | Method | Reference | Comment |
---|---|---|---|---|---|
ΔsubH° | 111. ± 8. | kJ/mol | C | Adedeji, Cavell, et al., 1979 | See also Cavell, Connor, et al., 1981.; AC |
ΔsubH° | 111.0 ± 8.0 | kJ/mol | RSC | Adedeji, Cavell, et al., 1979 | MS |

Gas phase ion energetics data

Data compiled as indicated in comments:
LLK - Sharon G. Lias, Rhoda D. Levin, and Sherif A. Kafafi
Ionization energy determinations
IE (eV) | Method | Reference | Comment |
---|---|---|---|
6.74 | PE | Bursten, Cotton, et al., 1980 | Vertical value; LLK |

Gas phase thermochemistry data

Data compiled by: José A. Martinho Simões
Quantity | Value | Units | Method | Reference | Comment |
---|---|---|---|---|---|
ΔfH°gas | 30.6 ± 2.9 | kcal/mol | Review | Martinho Simões |

References

Martinho Simões
Martinho Simões, J.A.,
Private communication (see http://webbook.nist.gov/chemistry/om/). [all data]
Adedeji, Cavell, et al., 1979
Adedeji, F.A.; Cavell, K.J.; Cavell, S.; Connor, J.A.; Skinner, H.A.; Zafarani-Moattar, M.T.,
J. Chem. Soc. Faraday Trans. 1, 1979, 75, 603. [all data]
Cavell, Connor, et al., 1981
Cavell, K.J.; Connor, J.A.; Pilcher, G.; Ribeiro da Silva, M.A.V.; Ribiero da Silva, D.M.C.; Vipmani, Y.; Zafarani-Moattar, M.T.,
J. Chem. Soc. Faraday Trans. 1, 1981, 77, 1585. [all data]
Bursten, Cotton, et al., 1980
Bursten, B.E.; Cotton, F.A.; Green, J.C.; Seddon, E.A.; Stanley, G.G.,
Molecular orbital and spectroscopic studies of triple bonds between transition-metal atoms. 1. The d3-d3 Mo2L6 compounds (L = OR, NR2, CH2R),
J. Am. Chem. Soc., 1980, 102, 4579. [all data]