Bis-(η6-1-(2-methylpropyl)benzene)chromium
- Formula: C20H28Cr
- Molecular weight: 320.4324
- CAS Registry Number: 51951-64-5

Condensed phase thermochemistry data

Data compiled by: José A. Martinho Simões
Quantity | Value | Units | Method | Reference | Comment |
---|---|---|---|---|---|
ΔfH°liquid | -55.4 ± 7.6 | kJ/mol | Review | Martinho Simões | |
Quantity | Value | Units | Method | Reference | Comment |
ΔcH°liquid | -12386.7 ± 7.1 | kJ/mol | CC-SB | Tel'noi, Rabinovich, et al., 1973 | Please also see Pedley and Rylance, 1977. |

Phase change data

Data compiled by: José A. Martinho Simões
Quantity | Value | Units | Method | Reference | Comment |
---|---|---|---|---|---|
ΔvapH° | 75.3 ± 8.4 | kJ/mol | CC-SB | Tel'noi, Rabinovich, et al., 1973 |

Gas phase ion energetics data

Data compiled as indicated in comments:
LBLHLM - Sharon G. Lias, John E. Bartmess, Joel F. Liebman, John L. Holmes, Rhoda D. Levin, and W. Gary Mallard
Ionization energy determinations
IE (eV) | Method | Reference | Comment |
---|---|---|---|
5.23 | PE | Cabelli, Cowley, et al., 1982 | Vertical value; LBLHLM |

Gas phase thermochemistry data

Data compiled by: José A. Martinho Simões
Quantity | Value | Units | Method | Reference | Comment |
---|---|---|---|---|---|
ΔfH°gas | 20. ± 11. | kJ/mol | Review | Martinho Simões |

References

Martinho Simões
Martinho Simões, J.A.,
Private communication (see http://webbook.nist.gov/chemistry/om/). [all data]
Tel'noi, Rabinovich, et al., 1973
Tel'noi, V.I.; Rabinovich, I.B.; Umilin, V.A.,
Dokl. Akad. Nauk SSSR, 1973, 209, 197. [all data]
Pedley and Rylance, 1977
Pedley, J.B.; Rylance, J.,
Computer Analysed Thermochemical Data: Organic and Organometallic Compounds, University of Sussex, Brigton, 1977. [all data]
Cabelli, Cowley, et al., 1982
Cabelli, D.E.; Cowley, A.H.; Lagowski, J.J.,
The bonding in some bis(arene)chromium compounds as indicated by U. V. photoelectron zpectroscopy,
Inorg. Chim. Acta, 1982, 57, 195. [all data]