Urethane
- Formula: C3H7NO2
- Molecular weight: 89.0932
- IUPAC Standard InChIKey: JOYRKODLDBILNP-UHFFFAOYSA-N
- CAS Registry Number: 51-79-6
- Chemical structure:
View 3d structure (requires JavaScript / HTML 5) - Other names: Carbamic acid, ethyl ester; Ethyl carbamate; Ethyl urethane; O-Ethylurethane; Leucethane; NSC 746; Pracarbamine; Urethan; NH2COOC2H5; A 11032; Aethylcarbamat; Aethylurethan; Carbamidsaeure-aethylester; Estane 5703; Ethyl urethan; Leucothane; Pracarbamin; U-Compound; Uretan; X 41; Ethylester kyseliny karbaminove; Rcra waste number U238; Uretan etylowy; Ethyl ester of carbamic acid

Gas phase thermochemistry data

Data compiled by: Hussein Y. Afeefy, Joel F. Liebman, and Stephen E. Stein
Quantity | Value | Units | Method | Reference | Comment |
---|---|---|---|---|---|
ΔfH°gas | -446.3 | kJ/mol | Cm | Bernard, Boukari, et al., 1976 | hfusion=20.9±0.8 kJ/mol |

Condensed phase thermochemistry data

Data compiled as indicated in comments:
ALS - Hussein Y. Afeefy, Joel F. Liebman, and Stephen E. Stein
DH - Eugene S. Domalski and Elizabeth D. Hearing
Quantity | Value | Units | Method | Reference | Comment |
---|---|---|---|---|---|
ΔfH°liquid | -497.3 | kJ/mol | Cm | Bernard, Boukari, et al., 1976 | hfusion=20.9±0.8 kJ/mol; ALS |
Quantity | Value | Units | Method | Reference | Comment |
ΔfH°solid | -517.1 | kJ/mol | Ccb | Schmidt and Becker, 1933 | ALS |
Quantity | Value | Units | Method | Reference | Comment |
ΔcH°solid | -1663.8 | kJ/mol | Ccb | Schmidt and Becker, 1933 | ALS |
Constant pressure heat capacity of solid
Cp,solid (J/mol*K) | Temperature (K) | Reference | Comment |
---|---|---|---|
156.43 | 300. | DeWit, DeKruif, et al., 1983 | T = 90 to 330 K.; DH |

Phase change data

Data compiled as indicated in comments:
BS - Robert L. Brown and Stephen E. Stein
TRC - Thermodynamics Research Center, NIST Boulder Laboratories, Chris Muzny director
ALS - Hussein Y. Afeefy, Joel F. Liebman, and Stephen E. Stein
AC - William E. Acree, Jr., James S. Chickos
DH - Eugene S. Domalski and Elizabeth D. Hearing
Quantity | Value | Units | Method | Reference | Comment |
---|---|---|---|---|---|
Tboil | 456.2 | K | N/A | Aldrich Chemical Company Inc., 1990 | BS |
Tboil | 458.40 | K | N/A | Lecat, 1947 | Uncertainty assigned by TRC = 0.6 K; TRC |
Quantity | Value | Units | Method | Reference | Comment |
Tfus | 322. ± 4. | K | AVG | N/A | Average of 6 values; Individual data points |
Quantity | Value | Units | Method | Reference | Comment |
Ttriple | 321.41 | K | N/A | De Wit, De Kruif, et al., 1983 | Uncertainty assigned by TRC = 0.02 K; TRC |
Quantity | Value | Units | Method | Reference | Comment |
ΔvapH° | 51. ± 2.5 | kJ/mol | V | Bernard, Boukari, et al., 1976 | hfusion=20.9±0.8 kJ/mol; ALS |
Quantity | Value | Units | Method | Reference | Comment |
ΔsubH° | 76.3 | kJ/mol | N/A | De Wit, Van Miltenburg, et al., 1983 | AC |
Enthalpy of vaporization
ΔvapH (kJ/mol) | Temperature (K) | Method | Reference | Comment |
---|---|---|---|---|
56.6 | 353. | A | Stephenson and Malanowski, 1987 | Based on data from 338. to 457. K. See also Stull, 1947.; AC |
Antoine Equation Parameters
log10(P) = A − (B / (T + C))
P = vapor pressure (bar)
T = temperature (K)
View plot Requires a JavaScript / HTML 5 canvas capable browser.
Temperature (K) | A | B | C | Reference | Comment |
---|---|---|---|---|---|
339.0 to 457. | 5.48918 | 2278.15 | -41.707 | Stull, 1947 | Coefficents calculated by NIST from author's data. |
Enthalpy of sublimation
ΔsubH (kJ/mol) | Temperature (K) | Method | Reference | Comment |
---|---|---|---|---|
77.7 | 265. | TE,ME | De Wit, Van Miltenburg, et al., 1983 | Based on data from 256. to 273. K.; AC |
71.9 | 322. | N/A | Bernard, Boukari, et al., 1976 | AC |
89.1 ± 0.8 | 299. | GS | Davies and Jones, 1959 | Based on data from 292. to 307. K.; AC |
Enthalpy of fusion
ΔfusH (kJ/mol) | Temperature (K) | Reference | Comment |
---|---|---|---|
16.794 | 321.41 | DeWit, DeKruif, et al., 1983 | DH |
20.900 | 321.7 | Bernard, Boukari, et al., 1976 | DH |
15.23 | 321.9 | Acree, 1991 | AC |
Entropy of fusion
ΔfusS (J/mol*K) | Temperature (K) | Reference | Comment |
---|---|---|---|
52.25 | 321.41 | DeWit, DeKruif, et al., 1983 | DH |
64.8 | 321.7 | Bernard, Boukari, et al., 1976 | DH |

Reaction thermochemistry data

Data compiled by: John E. Bartmess
Individual Reactions
C3H6NO2- + =
By formula: C3H6NO2- + H+ = C3H7NO2
Quantity | Value | Units | Method | Reference | Comment |
---|---|---|---|---|---|
ΔrH° | 1514. ± 9.6 | kJ/mol | G+TS | Taft, 1987 | gas phase; value altered from reference due to change in acidity scale |
Quantity | Value | Units | Method | Reference | Comment |
ΔrG° | 1485. ± 9.2 | kJ/mol | IMRE | Taft, 1987 | gas phase; value altered from reference due to change in acidity scale |

Gas phase ion energetics data

Data compiled as indicated in comments:
B - John E. Bartmess
LLK - Sharon G. Lias, Rhoda D. Levin, and Sherif A. Kafafi
Ionization energy determinations
IE (eV) | Method | Reference | Comment |
---|---|---|---|
10.2 | PE | Overman, Taylor, et al., 1978 | LLK |
10.62 | PE | Overman, Taylor, et al., 1978 | Vertical value; LLK |
De-protonation reactions
C3H6NO2- + =
By formula: C3H6NO2- + H+ = C3H7NO2
Quantity | Value | Units | Method | Reference | Comment |
---|---|---|---|---|---|
ΔrH° | 1514. ± 9.6 | kJ/mol | G+TS | Taft, 1987 | gas phase; value altered from reference due to change in acidity scale; B |
Quantity | Value | Units | Method | Reference | Comment |
ΔrG° | 1485. ± 9.2 | kJ/mol | IMRE | Taft, 1987 | gas phase; value altered from reference due to change in acidity scale; B |

Normal alkane RI, non-polar column, custom temperature program

Column type | Active phase | I | Reference | Comment |
---|---|---|---|---|
Other | Methyl Silicone | 838. | Ardrey and Moffat, 1981 | Program: not specified |

References

Bernard, Boukari, et al., 1976
Bernard, M.A.; Boukari, Y.; Busnot, F.,
Thermodynamic study of methyl and ethyl carbamates and their eutectic,
Thermochim. Acta, 1976, 16, 267-275. [all data]
Schmidt and Becker, 1933
Schmidt, V.A.; Becker, F.,
Die Bildungswarme von Nitrocellulofen, Nitroglycerin und anderen widuigen Beltandteilen von Treibmitteln,
Z. Gesamte Schiess Sprengstoffwes., 1933, 33, 280-282. [all data]
DeWit, DeKruif, et al., 1983
DeWit, H.G.M.; DeKruif, C.G.; Van Miltenburg, J.C.,
Thermodynamic properties of molecular organic crystals containing organic crystals containing nitrogen, oxygen, and sulfur. II. Molar heat capacities of eight compounds by adiabatic calorimetry,
J. Chem. Thermodynam., 1983, 15, 891-902. [all data]
Aldrich Chemical Company Inc., 1990
Aldrich Chemical Company Inc.,
Catalog Handbook of Fine Chemicals, Aldrich Chemical Company, Inc., Milwaukee WI, 1990, 1. [all data]
Lecat, 1947
Lecat, M.,
Orthobaric Azeotropes of Sulfides,
Bull. Cl. Sci., Acad. R. Belg., 1947, 33, 160-82. [all data]
De Wit, De Kruif, et al., 1983
De Wit, H.G.M.; De Kruif, C.G.; Van Miltenburg, J.C.,
Thermodynamic properties of molecular organic crystals containing nitrogen, oxygen, and sulfur II. Molar heat capacities of eight compounds by adiabatic calorimetry,
J. Chem. Thermodyn., 1983, 15, 9, 891, https://doi.org/10.1016/0021-9614(83)90095-2
. [all data]
De Wit, Van Miltenburg, et al., 1983
De Wit, H.G.M.; Van Miltenburg, J.C.; De Kruif, C.G.,
Thermodynamic properties of molecular organic crystals containing nitrogen, oxygen, and sulphur 1. Vapour pressures and enthalpies of sublimation,
The Journal of Chemical Thermodynamics, 1983, 15, 7, 651-663, https://doi.org/10.1016/0021-9614(83)90079-4
. [all data]
Stephenson and Malanowski, 1987
Stephenson, Richard M.; Malanowski, Stanislaw,
Handbook of the Thermodynamics of Organic Compounds, 1987, https://doi.org/10.1007/978-94-009-3173-2
. [all data]
Stull, 1947
Stull, Daniel R.,
Vapor Pressure of Pure Substances. Organic and Inorganic Compounds,
Ind. Eng. Chem., 1947, 39, 4, 517-540, https://doi.org/10.1021/ie50448a022
. [all data]
Davies and Jones, 1959
Davies, Mansel; Jones, A. Hamilton,
Lattice energies of some n-methyl amides and of some carbamates,
Trans. Faraday Soc., 1959, 55, 1329, https://doi.org/10.1039/tf9595501329
. [all data]
Acree, 1991
Acree, William E.,
Thermodynamic properties of organic compounds: enthalpy of fusion and melting point temperature compilation,
Thermochimica Acta, 1991, 189, 1, 37-56, https://doi.org/10.1016/0040-6031(91)87098-H
. [all data]
Taft, 1987
Taft, R.W.,
The Nature and Analysis of Substitutent Electronic Effects,
Personal communication. See also Prog. Phys. Org. Chem., 1987, 16, 1. [all data]
Overman, Taylor, et al., 1978
Overman, L.E.; Taylor, G.F.; Houk, K.N.; Domelsmith, L.N.,
Diels-Alder reactions between trans-1-N-acylamino-1,3-dienes and methyl acrylate. A correlation between diene photoelectron ionization potentials and reactivity, stereoselectivity, and regioselectivity,
J. Am. Chem. Soc., 1978, 100, 3182. [all data]