1,3-Dimethyl-2,4,5-trioxoimidazolidine
- Formula: C5H6N2O3
- Molecular weight: 142.1127
- IUPAC Standard InChIKey: UJYBVDOLXHCNOL-UHFFFAOYSA-N
- CAS Registry Number: 5176-82-9
- Chemical structure:
View 3d structure (requires JavaScript / HTML 5) - Other names: Imidazolidinetrione, dimethyl-; Dimethylparabanic acid; N,N'-Dimethylparabanic acid; 1,3-Dimethylparabanic acid; N,N'-Dimethylimidazoline-trione

Gas phase ion energetics data

Data compiled as indicated in comments:
LBLHLM - Sharon G. Lias, John E. Bartmess, Joel F. Liebman, John L. Holmes, Rhoda D. Levin, and W. Gary Mallard
LLK - Sharon G. Lias, Rhoda D. Levin, and Sherif A. Kafafi
Ionization energy determinations
IE (eV) | Method | Reference | Comment |
---|---|---|---|
10.19 | PE | Meeks, Arnett, et al., 1975 | LLK |
10.19 | PE | Roth, Bock, et al., 1985 | Vertical value; LBLHLM |

References

Meeks, Arnett, et al., 1975
Meeks, J.L.; Arnett, J.F.; Larson, D.; McGlynn, S.P.,
Photoelectron spectroscopy of carbonyls. Ionization assignments,
Chem. Phys. Lett., 1975, 30, 190. [all data]
Roth, Bock, et al., 1985
Roth, B.; Bock, H.; Gotthardt, H.,
Radikalionen 66. Thioparabansaure-derivate: Ionisation zum Radikalkation und reduktion zum radikalanion,
Phosphorus Sulfur, 1985, 22, 109. [all data]