5,6,11,12-Tetraphenylnaphthacene
- Formula: C42H28
- Molecular weight: 532.6717
- IUPAC Standard InChIKey: YYMBJDOZVAITBP-UHFFFAOYSA-N
- CAS Registry Number: 517-51-1
- Chemical structure:
View 3d structure (requires JavaScript / HTML 5) - Other names: Rubrene; Naphthacene, 5,6,11,12-tetraphenyl-; Rubren; 5,6,11,12-Tetraphenyltetracene

Phase change data

Data compiled as indicated in comments:
DRB - Donald R. Burgess, Jr.
AC - William E. Acree, Jr., James S. Chickos
ALS - Hussein Y. Afeefy, Joel F. Liebman, and Stephen E. Stein
Quantity | Value | Units | Method | Reference | Comment |
---|---|---|---|---|---|
ΔsubH° | 262. | kJ/mol | Review | Roux, Temprado, et al., 2008 | There are insufficient literature values to properly evaluated the data and measurements are of low quality and/or there is substantial disagreement with values predicted using thermochemical cycles or estimation methods (trends). The value is substantially depended upon an estimate with a low degree of confidence.; DRB |
Enthalpy of sublimation
ΔsubH (kJ/mol) | Temperature (K) | Method | Reference | Comment |
---|---|---|---|---|
160.6 ± 4.2 | 488. | N/A | Hoyer and Peperle, 1958 | Based on data from 453. to 523. K. See also Cox and Pilcher, 1970.; AC |
162.8 ± 4.2 | 453. | V | Hoyer and Peperle, 1958, 2 | Reanalyzed by Pedley, Naylor, et al., 1986, Original value = 157. kJ/mol; ALS |

Gas phase ion energetics data

Data compiled as indicated in comments:
LLK - Sharon G. Lias, Rhoda D. Levin, and Sherif A. Kafafi
Ionization energy determinations
IE (eV) | Method | Reference | Comment |
---|---|---|---|
6.41 | PE | Sato, Seki, et al., 1981 | LLK |

References

Roux, Temprado, et al., 2008
Roux, M.V.; Temprado, M.; Chickos, J.S.; Nagano, Y.,
Critically Evaluated Thermochemical Properties of Polycyclic Aromatic Hydrocarbons,
J. Phys. Chem. Ref. Data, 2008, 37, 4, 1855-1996. [all data]
Hoyer and Peperle, 1958
Hoyer, H.; Peperle, W.,
Z. Elektrochem., 1958, 62, 61. [all data]
Cox and Pilcher, 1970
Cox, J.D.; Pilcher, G.,
Thermochemistry of Organic and Organometallic Compounds, Academic Press Inc., London, 1970, 643. [all data]
Hoyer and Peperle, 1958, 2
Hoyer, H.; Peperle, W.,
Dampfdrunkmessungen an organischen substanzen und ihre sublimationswarmen,
Z. Electrochem., 1958, 62, 61-66. [all data]
Pedley, Naylor, et al., 1986
Pedley, J.B.; Naylor, R.D.; Kirby, S.P.,
Thermochemical Data of Organic Compounds, Chapman and Hall, New York, 1986, 1-792. [all data]
Sato, Seki, et al., 1981
Sato, N.; Seki, K.; Inokuchi, H.,
Polarization energies of organic solids determined by ultraviolet photoelectron spectroscopy,
J. Chem. Soc. Faraday Trans. 2, 1981, 77, 1621. [all data]