4a(2H)-Naphthalenol,octahydro-8a-methyl-cis-

Gas phase ion energetics data

Data compiled by: Sharon G. Lias, Rhoda D. Levin, and Sherif A. Kafafi

Ionization energy determinations

IE (eV) Method Reference Comment
9.45 ± 0.02PEBrown, Marcinko, et al., 1979Vertical value

References

Brown, Marcinko, et al., 1979
Brown, R.S.; Marcinko, R.W.; Tse, A., Application of photoelectron spectroscopy to substituent effects. Conformational analysis of some flexible allylic ethers and alcohols, Can. J. Chem., 1979, 57, 1890. [all data]