Disodium molybdenum tetraoxide
- Formula: MoNa2O4
- Molecular weight: 205.94
- CAS Registry Number: 51682-41-8

Gas phase ion energetics data

Data compiled by: Sharon G. Lias, Rhoda D. Levin, and Sherif A. Kafafi
Ionization energy determinations
IE (eV) | Method | Reference |
---|---|---|
7.2 | EI | Johnson, 1975 |

References

Johnson, 1975
Johnson, I.,
Mass spectrometric study of the vaporization of cesium and sodium molybdates,
J. Phys. Chem., 1975, 79, 722. [all data]