Neon, compound with krypton (1:1)
- Formula: KrNe
- Molecular weight: 103.978
- IUPAC Standard InChIKey: SLSBUGNNRDXZJZ-UHFFFAOYSA-N
- CAS Registry Number: 51682-34-9
- Chemical structure:
View 3d structure (requires JavaScript / HTML 5) - Permanent link for this species. Use this link for bookmarking this species for future reference.

Gas phase ion energetics data

Data compiled as indicated in comments:
LBLHLM - Sharon G. Lias, John E. Bartmess, Joel F. Liebman, John L. Holmes, Rhoda D. Levin, and W. Gary Mallard
Ionization energy determinations
IE (eV) | Method | Reference | Comment |
---|---|---|---|
13.950 ± 0.003 | PI | Pratt and Dehmer, 1982 | LBLHLM |

Constants of diatomic molecules

Data compiled by: Klaus P. Huber and Gerhard H. Herzberg
Data collected through March, 1977
Symbol | Meaning |
---|---|
State | electronic state and / or symmetry symbol |
Te | minimum electronic energy (cm-1) |
ωe | vibrational constant – first term (cm-1) |
ωexe | vibrational constant – second term (cm-1) |
ωeye | vibrational constant – third term (cm-1) |
Be | rotational constant in equilibrium position (cm-1) |
αe | rotational constant – first term (cm-1) |
γe | rotation-vibration interaction constant (cm-1) |
De | centrifugal distortion constant (cm-1) |
βe | rotational constant – first term, centrifugal force (cm-1) |
re | internuclear distance (Å) |
Trans. | observed transition(s) corresponding to electronic state |
ν00 | position of 0-0 band (units noted in table) |
State | Te | ωe | ωexe | ωeye | Be | αe | γe | De | βe | re | Trans. | ν00 |
---|---|---|---|---|---|---|---|---|---|---|---|---|
X 1Σ+ | 0 | [(18.7)] 1 | 3.58 2 |

References

Pratt and Dehmer, 1982
Pratt, S.T.; Dehmer, P.M.,
Photoionization of the neon-rare gas dimers NeAr, NeKr, and NeXe,
J. Chem. Phys., 1982, 76, 3433. [all data]
Bobetic and Barker, 1976
Bobetic, M.V.; Barker, J.A.,
Vibrational levels of heteronuclear rare gas van der Waals molecules,
J. Chem. Phys., 1976, 64, 2367-2369. [all data]
Ng, Lee, et al., 1974
Ng, C.Y.; Lee, Y.T.; Barker, J.A.,
Improved potentials for Ne + Ar, Ne + Kr, and Ne + Xe,
J. Chem. Phys., 1974, 61, 1996. [all data]
Tanaka, Yoshino, et al., 1975
Tanaka, Y.; Yoshino, K.; Freeman, D.E.,
Emission spectra of heteronuclear diatomic rare gas positive ions,
J. Chem. Phys., 1975, 62, 4484. [all data]