Stannane,(cyclopropylmethyl)trimethyl-
- Formula: C7H16Sn
- Molecular weight: 218.912
- IUPAC Standard InChIKey: CAZNBDANRQXPJU-UHFFFAOYSA-N
- CAS Registry Number: 51675-53-7
- Chemical structure:
View 3d structure (requires JavaScript / HTML 5) - Permanent link for this species. Use this link for bookmarking this species for future reference.

Gas phase ion energetics data

Data compiled by: Sharon G. Lias, Rhoda D. Levin, and Sherif A. Kafafi
Ionization energy determinations
IE (eV) | Method | Reference | Comment |
---|---|---|---|
8.85 | PE | Brown, Eaton, et al., 1974 | Vertical value |
9.52 | PE | Brown, Eaton, et al., 1974 | Vertical value |

References

Brown, Eaton, et al., 1974
Brown, R.S.; Eaton, D.F.; Hosomi, A.; Traylor, T.G.; Wright, J.M.,
Photoelectron spectra of cyclopropylcarbinyltrimethyltin and allyltrimethyltin. A comparison of σ-σ and σ-π conjugation,
J. Organomet. Chem., 1974, 66, 249. [all data]