Phenol, 4-(2-aminoethyl)-
- Formula: C8H11NO
- Molecular weight: 137.1790
- IUPAC Standard InChIKey: DZGWFCGJZKJUFP-UHFFFAOYSA-N
- CAS Registry Number: 51-67-2
- Chemical structure:
View 3d structure (requires JavaScript / HTML 5) - Other names: Phenol, p-(2-aminoethyl)-; α-(4-Hydroxyphenyl)-β-aminoethane; β-(4-Hydroxyphenyl)ethylamine; p-β-Aminoethylphenol; p-(2-Aminoethyl)phenol; p-Hydroxyphenethylamine; p-Hydroxyphenylethylamine; p-Tyramine; Benzeneethanamine, 4-hydroxy-; Systogene; Tocosine; Tyramin; Tyramine; Tyrosamine; Uteramine; 2-(p-Hydroxyphenyl)ethylamine; 2-(4-Hydroxyphenyl)ethylamine; 4-Hydroxy-β-phenylethylamine; 4-Hydroxyphenethylamine; 4-Hydroxyphenylethylamine; Tyramine base; p-Hydroxy-β-phenethylamine; Phenethylamine, p-hydroxy-; Tenosin-Wirkstoff; 4-(2-Aminoethyl)phenol; 2-(4'-Hydroxyphenyl)ethylamine; p-Hydroxy-β-phenylethylamine; NSC 249188

Phase change data

Data compiled by: Robert L. Brown and Stephen E. Stein
Reduced pressure boiling point
Tboil (K) | Pressure (bar) | Reference |
---|---|---|
451.2 | 0.01 | Aldrich Chemical Company Inc., 1990 |

Gas phase ion energetics data

Data compiled by: Sharon G. Lias, Rhoda D. Levin, and Sherif A. Kafafi
Ionization energy determinations
IE (eV) | Method | Reference | Comment |
---|---|---|---|
8.41 ± 0.12 | PE | Domelsmith, Munchausen, et al., 1977 | Vertical value |

Kovats' RI, non-polar column, custom temperature program

Column type | Active phase | I | Reference | Comment |
---|---|---|---|---|
Packed | SE-30 | 1405. | Ramsey, Lee, et al., 1980 | He, Chromosorb G HP (80-100 mesh); Column length: 1.5 m; Program: not specified |

Van Den Dool and Kratz RI, non-polar column, temperature ramp

Column type | Active phase | I | Reference | Comment |
---|---|---|---|---|
Packed | SE-30 | 1430. | Perrigo and Peel, 1981 | N2, Chromosorb W, 130. C @ 2. min, 8. K/min, 290. C @ 8. min; Column length: 1.8 m |

Van Den Dool and Kratz RI, non-polar column, custom temperature program

Column type | Active phase | I | Reference | Comment |
---|---|---|---|---|
Capillary | HP-5MS | 1660.9 | Andriamaharavo, 2014 | 30. m/0.25 mm/0.25 μm, He; Program: 60C (1 min) => 5 C/min => 210C => 10 C/min => 280C (15 min) |

Normal alkane RI, non-polar column, custom temperature program

Column type | Active phase | I | Reference | Comment |
---|---|---|---|---|
Other | Methyl Silicone | 1436. | Ardrey and Moffat, 1981 | Program: not specified |

References

Aldrich Chemical Company Inc., 1990
Aldrich Chemical Company Inc.,
Catalog Handbook of Fine Chemicals, Aldrich Chemical Company, Inc., Milwaukee WI, 1990, 1. [all data]
Domelsmith, Munchausen, et al., 1977
Domelsmith, L.N.; Munchausen, L.L.; Houk, K.N.,
Photoelectron spectra of psychotropic drugs. 1. Phenethylamines, tryptamines, and LSD,
J. Am. Chem. Soc., 1977, 99, 4311. [all data]
Ramsey, Lee, et al., 1980
Ramsey, J.D.; Lee, T.D.; Osselton, M.D.; Moffat, A.C.,
Gas-liquid chromatographic retention indices of 296 non-drug substances on SE-30 or OV-1 likely to be encountered in toxicological analyses,
J. Chromatogr., 1980, 184, 2, 185-206, https://doi.org/10.1016/S0021-9673(00)85641-1
. [all data]
Perrigo and Peel, 1981
Perrigo, B.J.; Peel, H.W.,
The use of retention indices and temperature-programmed gas chromatography in analytical toxicology,
J. Chromatogr. Sci., 1981, 19, 5, 219-226, https://doi.org/10.1093/chromsci/19.5.219
. [all data]
Andriamaharavo, 2014
Andriamaharavo, N.R.,
Retention Data. NIST Mass Spectrometry Data Center., NIST Mass Spectrometry Data Center, 2014. [all data]
Ardrey and Moffat, 1981
Ardrey, R.E.; Moffat, A.C.,
Gas-liquid chromatographic retention indices of 1318 substances of toxicological interest on SE-30 or OV-1 stationary phase,
J. Chromatogr., 1981, 220, 3, 195-252, https://doi.org/10.1016/S0021-9673(00)81925-1
. [all data]