Methacetin
- Formula: C9H11NO2
- Molecular weight: 165.1891
- IUPAC Standard InChIKey: XVAIDCNLVLTVFM-UHFFFAOYSA-N
- CAS Registry Number: 51-66-1
- Chemical structure:
View 3d structure (requires JavaScript / HTML 5) - Other names: Acetamide, N-(4-methoxyphenyl)-; p-Acetanisidide; p-Acetanisidine; p-Methoxyacetanilide; Aceto-p-anisidide; Acetyl-p-anisidine; Metacetin; N-Acetyl-p-methoxyaniline; 4-Methoxyacetanilide; 4'-Methoxyacetanilide; N-Acetyl-p-anisidine; Aceto-p-anisidine; Acetanilide, 4'-methoxy-; N-(4-Methoxyphenyl)acetamide; N-(p-Methoxyphenyl)acetamide; 4-(Acetylamino)anisole; NSC 4687; Acetanilide, 4-methoxy; N-(4-Methoxyphenyl)acetic acid amide

Phase change data

Data compiled as indicated in comments:
TRC - Thermodynamics Research Center, NIST Boulder Laboratories, Chris Muzny director
AC - William E. Acree, Jr., James S. Chickos
Quantity | Value | Units | Method | Reference | Comment |
---|---|---|---|---|---|
Tfus | 400.3 | K | N/A | Manzo and Ahumanda, 1990 | Uncertainty assigned by TRC = 0.5 K; TRC |
Enthalpy of fusion
ΔfusH (kJ/mol) | Temperature (K) | Reference | Comment |
---|---|---|---|
27.82 | 400.3 | Manzo and Ahumada, 1990 | AC |

Gas phase ion energetics data

Data compiled by: Henry M. Rosenstock, Keith Draxl, Bruce W. Steiner, and John T. Herron
Ionization energy determinations
IE (eV) | Method | Reference |
---|---|---|
8.1 ± 0.2 | EI | Gamble, Gilbert, et al., 1970 |
Appearance energy determinations
Ion | AE (eV) | Other Products | Method | Reference | Comment |
---|---|---|---|---|---|
C7H9NO+ | 10.7 ± 0.2 | ? | EI | Gamble, Gilbert, et al., 1970 |

Van Den Dool and Kratz RI, non-polar column, temperature ramp

Data compiled by: NIST Mass Spectrometry Data Center, William E. Wallace, director

Column type Capillary
Active phase VF-5MS
Column length (m) 30.
Carrier gas He
Substrate
Column diameter (mm) 0.25
Phase thickness (μm) 0.25
Tstart (C) 60.
Tend (C) 270.
Heat rate (K/min)
Initial hold (min)
Final hold (min)
I 1648.
ReferenceN/A
Comment MSDC-RI

References

Manzo and Ahumanda, 1990
Manzo, R.H.; Ahumanda, A.A.,
Effects of solvent medium on solubility. V: Enthalpic and entropic contributions to the free energy changes of Di-substituted benzene derivatives in ethanol: Water and ethanol: Cyclohexane mixtures,
J. Pharm. Sci., 1990, 79, 12, 1109, https://doi.org/10.1002/jps.2600791214
. [all data]
Manzo and Ahumada, 1990
Manzo, Ruben H.; Ahumada, Amelia A.,
Effects of solvent medium on solubility. V: Enthalpic and entropic contributions to the free energy changes of Di-substituted benzene derivatives in ethanol: Water and ethanol: Cyclohexane mixtures,
J. Pharm. Sci., 1990, 79, 12, 1109-1115, https://doi.org/10.1002/jps.2600791214
. [all data]
Gamble, Gilbert, et al., 1970
Gamble, A.A.; Gilbert, J.R.; Tillett, J.G.,
Substituent effects in the fragmentation of acetanilides,,
J. Chem. Soc. B, 1970, 1231. [all data]