1-Butene, 4-bromo-
- Formula: C4H7Br
- Molecular weight: 135.002
- IUPAC Standard InChIKey: DMAYBPBPEUFIHJ-UHFFFAOYSA-N
- CAS Registry Number: 5162-44-7
- Chemical structure:
View 3d structure (requires JavaScript / HTML 5) - Other names: 1-Bromo-3-butene; 3-Butenyl bromide; 4-Bromo-1-butene; 4-Bromobutene; 4-Bromobutene-(1); Homoallyl bromide; 4-bromobut-1-ene

Phase change data

Data compiled by: Robert L. Brown and Stephen E. Stein
Quantity | Value | Units | Method | Reference | Comment |
---|---|---|---|---|---|
Tboil | 371.7 | K | N/A | Weast and Grasselli, 1989 | |
Tboil | 371.6 | K | N/A | Buckingham and Donaghy, 1982 |

Reaction thermochemistry data

Data compiled by: Hussein Y. Afeefy, Joel F. Liebman, and Stephen E. Stein
Individual Reactions
By formula: C4H7Br = C4H7Br
Quantity | Value | Units | Method | Reference | Comment |
---|---|---|---|---|---|
ΔrH° | 2.8 ± 0.14 | kcal/mol | Eqk | Shishinova, Levanova, et al., 1978 | gas phase; UV Irradiation |
ΔrH° | 2.8 ± 0.14 | kcal/mol | Eqk | Shishinova, Levanova, et al., 1977 | gas phase |

Gas phase ion energetics data

Data compiled by: Sharon G. Lias, Rhoda D. Levin, and Sherif A. Kafafi
Ionization energy determinations
IE (eV) | Method | Reference |
---|---|---|
9.9 | EI | Tomer, Turk, et al., 1972 |
Appearance energy determinations
Ion | AE (eV) | Other Products | Method | Reference | Comment |
---|---|---|---|---|---|
C3H5+ | 12.6 | CH2Br | EI | Tomer, Turk, et al., 1972 | |
C4H7+ | 10.6 | Br | EI | Tomer, Turk, et al., 1972 |

References

Weast and Grasselli, 1989
CRC Handbook of Data on Organic Compounds, 2nd Editon, Weast,R.C and Grasselli, J.G., ed(s)., CRC Press, Inc., Boca Raton, FL, 1989, 1. [all data]
Buckingham and Donaghy, 1982
Buckingham, J.; Donaghy, S.M.,
Dictionary of Organic Compounds: Fifth Edition, Chapman and Hall, New York, 1982, 1. [all data]
Shishinova, Levanova, et al., 1978
Shishinova, V.I.; Levanova, S.V.; Shevtsova, L.A.; Rozhnov, A.M.; Kudryavtsev, V.A.,
Thermodynamic functions of bromobutenes,
Russ. J. Phys. Chem. (Engl. Transl.), 1978, 52, 270-271. [all data]
Shishinova, Levanova, et al., 1977
Shishinova, V.I.; Levanova, S.V.; Shevtsova, L.A.; Rozhnov, A.M.; Kudryavtsev, V.A.,
Thermodynamic functions of bromobutenes,
Deposited Doc., 1977, 1-6. [all data]
Tomer, Turk, et al., 1972
Tomer, K.B.; Turk, J.; Shapiro, R.H.,
Anchimeric assistance in electron-impact reactions: Homoallylic systems,
Org. Mass Spectrom., 1972, 6, 235. [all data]