Methanone, (2-chlorophenyl)phenyl-
- Formula: C13H9ClO
- Molecular weight: 216.663
- IUPAC Standard InChIKey: VMHYWKBKHMYRNF-UHFFFAOYSA-N
- CAS Registry Number: 5162-03-8
- Chemical structure:
View 3d structure (requires JavaScript / HTML 5) - Other names: Benzophenone, 2-chloro-; o-Chlorobenzophenone; 2-Chlorobenzophenone

Phase change data

Data compiled as indicated in comments:
BS - Robert L. Brown and Stephen E. Stein
AC - William E. Acree, Jr., James S. Chickos
Quantity | Value | Units | Method | Reference | Comment |
---|---|---|---|---|---|
Tboil | 603.2 | K | N/A | Weast and Grasselli, 1989 | BS |
Quantity | Value | Units | Method | Reference | Comment |
ΔsubH° | 100.2 ± 0.4 | kJ/mol | C | Ribeiro da Silva, Amaral, et al., 2007 | AC |

Gas phase ion energetics data

Data compiled by: Sharon G. Lias, Rhoda D. Levin, and Sherif A. Kafafi
Ionization energy determinations
IE (eV) | Method | Reference |
---|---|---|
9.6 ± 0.1 | EI | Krenmayr, Heller, et al., 1974 |
9.6 ± 0.1 | EI | Heller, Varmuza, et al., 1974 |
Appearance energy determinations
Ion | AE (eV) | Other Products | Method | Reference | Comment |
---|---|---|---|---|---|
C6H4Cl+ | 15.6 ± 0.3 | ? | EI | Krenmayr, Heller, et al., 1974 | |
C6H5+ | 15.0 ± 0.3 | ? | EI | Krenmayr, Heller, et al., 1974 | |
C7H4OCl+ | 11.4 ± 0.1 | C6H5 | EI | Krenmayr, Heller, et al., 1974 | |
C7H4OCl+ | 11.4 ± 0.1 | C6H5 | EI | Heller, Varmuza, et al., 1974 | |
C7H5O+ | 11.1 ± 0.1 | ? | EI | Krenmayr, Heller, et al., 1974 | |
C13H9O+ | 10.9 ± 0.2 | ? | EI | Krenmayr, Heller, et al., 1974 |

Kovats' RI, non-polar column, temperature ramp

Column type | Active phase | I | Reference | Comment |
---|---|---|---|---|
Capillary | Methyl Silicone | 1720. | Maurer and Pfleger, 1988 | 12. m/0.20 mm/0.33 μm, He, 100. C @ 3. min, 30. K/min, 310. C @ 5. min |

References

Weast and Grasselli, 1989
CRC Handbook of Data on Organic Compounds, 2nd Editon, Weast,R.C and Grasselli, J.G., ed(s)., CRC Press, Inc., Boca Raton, FL, 1989, 1. [all data]
Ribeiro da Silva, Amaral, et al., 2007
Ribeiro da Silva, Manuel A.V.; Amaral, Luísa M.P.F.; Gomes, José R.B.,
Experimental and Computational Studies on the Molecular Energetics of Chlorobenzophenones,
J. Phys. Chem. B, 2007, 111, 45, 13033-13040, https://doi.org/10.1021/jp076522j
. [all data]
Krenmayr, Heller, et al., 1974
Krenmayr, P.; Heller, R.; Varmuza, K.,
Massenspektrometrische untersuchungen an benzophenon und substituierten benzophenonen. I. Ermittlung thermodynamischer grossen,
Org. Mass Spectrom., 1974, 9, 998. [all data]
Heller, Varmuza, et al., 1974
Heller, R.; Varmuza, K.; Krenmayr, P.,
Massenspektrometrische untersuchung des substituenteneffektes bei einfach substituierten benzophenonen,
Monatsh. Chem., 1974, 105, 787. [all data]
Maurer and Pfleger, 1988
Maurer, H.; Pfleger, K.,
Identification and Differentiation of Alkylamine Antihistamines and Their Metabolites in Urine by Computerized Gas Chromatography-Mass Spectrometry,
J. Chromatogr., 1988, 430, 31-41, https://doi.org/10.1016/S0378-4347(00)83131-X
. [all data]