3,3-Dimethyldiazirine
- Formula: C3H6N2
- Molecular weight: 70.0931
- IUPAC Standard InChIKey: JYSCQQRNTHDPBR-UHFFFAOYSA-N
- CAS Registry Number: 5161-49-9
- Chemical structure:
View 3d structure (requires JavaScript / HTML 5) - Permanent link for this species. Use this link for bookmarking this species for future reference.

Gas phase ion energetics data

Data compiled as indicated in comments:
RDSH - Henry M. Rosenstock, Keith Draxl, Bruce W. Steiner, and John T. Herron
Ionization energy determinations
IE (eV) | Method | Reference | Comment |
---|---|---|---|
9.76 | PE | Haselbach, Heilbronner, et al., 1970 | Vertical value; RDSH |

Normal alkane RI, non-polar column, custom temperature program

Column type | Active phase | I | Reference | Comment |
---|---|---|---|---|
Capillary | Methyl Silicone | 459. | Zenkevich, 1996 | Program: not specified |

References

Haselbach, Heilbronner, et al., 1970
Haselbach, E.; Heilbronner, E.; Mannschreck, A.; Seitz, W.,
Lone pair interaction in 3,3-dimethyldiazirine,
Angew. Chem. Int. Ed. Engl., 1970, 9, 902. [all data]
Zenkevich, 1996
Zenkevich, I.G.,
Informational Maitenance of Gas Chromatographic Identification of Organic Compounds in Ecoanalytical Investigations,
Z. Anal. Chem., 1996, 51, 11, 1140-1148. [all data]