Methylmalonic acid
- Formula: C4H6O4
- Molecular weight: 118.0880
- IUPAC Standard InChIKey: ZIYVHBGGAOATLY-UHFFFAOYSA-N
- CAS Registry Number: 516-05-2
- Chemical structure:
View 3d structure (requires JavaScript / HTML 5) - Other names: Propanedioic acid, methyl-; Isosuccinic acid; Malonic acid, methyl-; 1,1-Ethanedicarboxylic acid; 2-Methylmalonic acid

Phase change data

Data compiled as indicated in comments:
AC - William E. Acree, Jr., James S. Chickos
ALS - Hussein Y. Afeefy, Joel F. Liebman, and Stephen E. Stein
Quantity | Value | Units | Method | Reference | Comment |
---|---|---|---|---|---|
ΔsubH° | 117.4 ± 1.9 | kJ/mol | ME | Ribeiro da Silva, Monte, et al., 2000 | AC |
ΔsubH° | 113.2 ± 0.4 | kJ/mol | C | Al-Takhin, Pilcher, et al., 1983 | ALS |

Gas phase ion energetics data

Data compiled by: Sharon G. Lias, Rhoda D. Levin, and Sherif A. Kafafi
Ionization energy determinations
IE (eV) | Method | Reference | Comment |
---|---|---|---|
10.80 | PE | Ajo, Ciliberto, et al., 1980 | Vertical value |

References

Ribeiro da Silva, Monte, et al., 2000
Ribeiro da Silva, Manuel A.V.; Monte, Manuel J.S.; Ribeiro, José R.,
Standard Enthalpies, Entropies, and Gibbs Functions of Sublimation of Four Alkyl-Substituted Malonic Acids,
J. Chem. Eng. Data, 2000, 45, 5, 756-759, https://doi.org/10.1021/je000090n
. [all data]
Al-Takhin, Pilcher, et al., 1983
Al-Takhin, G.; Pilcher, G.; Bickerton, J.,
Standard enthalpies of formation of diamine(dicarboxylato)platinum(II) complexes and of bis(pentane-2,4-dionato)platinum(II): the mean Pt-O bond dissociation enthalpies,
J. Chem. Soc. Dalton Trans., 1983, 2657-2659. [all data]
Ajo, Ciliberto, et al., 1980
Ajo, D.; Ciliberto, E.; Fragala, I.; Granozzi, G.,
Lone-pair interactions in the photoelectron spectra of dicarboxylic acids: Malonic acid its α-alkyl derivatives,
J. Mol. Struct., 1980, 62, 189. [all data]