Cyclopropane, (1-methyl-1,2-propadienyl)-

Gas phase ion energetics data

Data compiled as indicated in comments:
LLK - Sharon G. Lias, Rhoda D. Levin, and Sherif A. Kafafi

Ionization energy determinations

IE (eV) Method Reference Comment
8.83PEDewar, Fonken, et al., 1976LLK

References

Dewar, Fonken, et al., 1976
Dewar, M.J.S.; Fonken, G.J.; Jones, T.B.; Minter, D.E., Photoelectron spectra of molecules. Part VII. Cyclopropylallenes, J. Chem. Soc. Perkin Trans. 2, 1976, 764. [all data]