1,3-Diazatricyclo[3.3.1.13,7]decane,6-methylene-

Gas phase ion energetics data

Data compiled by: Sharon G. Lias, Rhoda D. Levin, and Sherif A. Kafafi

Ionization energy determinations

IE (eV) Method Reference Comment
7.53PEGleiter, Kobayashi, et al., 1976Vertical value

References

Gleiter, Kobayashi, et al., 1976
Gleiter, R.; Kobayashi, M.; Kuthan, J., The n-orbital sequence in 1,3-diazaadamantane, Tetrahedron, 1976, 32, 2775. [all data]