Propane, 2-(ethylthio)-
- Formula: C5H12S
- Molecular weight: 104.214
- IUPAC Standard InChIKey: NZUQQADVSXWVNW-UHFFFAOYSA-N
- CAS Registry Number: 5145-99-3
- Chemical structure:
View 3d structure (requires JavaScript / HTML 5) - Other names: Sulfide, ethyl isopropyl; Ethyl isopropyl sulfide; Isopropyl ethyl sulfide; 2-(Ethylthio)propane; Isopropyl ethyl sulphide; C2H5S(iso-C3H7); 2-Methyl-3-thiapentane; Ethyl isopropyl sulphide

Gas phase thermochemistry data

Data compiled by: Hussein Y. Afeefy, Joel F. Liebman, and Stephen E. Stein
Quantity | Value | Units | Method | Reference | Comment |
---|---|---|---|---|---|
ΔfH°gas | -117. ± 3. | kJ/mol | Ccb | Mackle and Mayrick, 1962 |

Condensed phase thermochemistry data

Data compiled by: Hussein Y. Afeefy, Joel F. Liebman, and Stephen E. Stein
Quantity | Value | Units | Method | Reference | Comment |
---|---|---|---|---|---|
ΔfH°liquid | -156. ± 2. | kJ/mol | Ccb | Mackle and Mayrick, 1962 | |
Quantity | Value | Units | Method | Reference | Comment |
ΔcH°liquid | -4128.3 ± 2.0 | kJ/mol | Ccb | Mackle and Mayrick, 1962 |

Phase change data

Data compiled as indicated in comments:
TRC - Thermodynamics Research Center, NIST Boulder Laboratories, Chris Muzny director
AC - William E. Acree, Jr., James S. Chickos
ALS - Hussein Y. Afeefy, Joel F. Liebman, and Stephen E. Stein
DRB - Donald R. Burgess, Jr.
Quantity | Value | Units | Method | Reference | Comment |
---|---|---|---|---|---|
Tboil | 380.5 | K | N/A | Mcallan, Cullum, et al., 1951 | Uncertainty assigned by TRC = 0.3 K; TRC |
Tboil | 376. | K | N/A | Ingold, Jessop, et al., 1933 | Uncertainty assigned by TRC = 3. K; TRC |
Quantity | Value | Units | Method | Reference | Comment |
Tfus | 150.96 | K | N/A | Mcallan, Cullum, et al., 1951 | Uncertainty assigned by TRC = 0.1 K; TRC |
Quantity | Value | Units | Method | Reference | Comment |
ΔvapH° | 37.8 | kJ/mol | N/A | Shimizu, Saito, et al., 1981 | AC |
ΔvapH° | 38.5 | kJ/mol | N/A | Reid, 1972 | AC |
ΔvapH° | 37.9 ± 0.8 | kJ/mol | GC | Mackle and McClean, 1964 | AC |
ΔvapH° | 39. ± 1. | kJ/mol | V | Mackle and Mayrick, 1962 | ALS |
ΔvapH° | 39.0 | kJ/mol | N/A | Mackle and Mayrick, 1962 | DRB |
Enthalpy of vaporization
ΔvapH (kJ/mol) | Temperature (K) | Method | Reference | Comment |
---|---|---|---|---|
38.1 | 299. | N/A | Dykyj, Svoboda, et al., 1999 | Based on data from 284. to 406. K.; AC |
36.3 | 334. | A,EB | Stephenson and Malanowski, 1987 | Based on data from 319. to 391. K. See also White, Barnard--Smith, et al., 1952.; AC |
38.1 | 313. | EB | Mackle and Mayrick, 1962, 2 | Based on data from 296. to 325. K.; AC |

Gas phase ion energetics data

Data compiled by: Sharon G. Lias, Rhoda D. Levin, and Sherif A. Kafafi
Ionization energy determinations
IE (eV) | Method | Reference |
---|---|---|
8.35 ± 0.01 | PI | Trofimov, Mel'der, et al., 1975 |

Kovats' RI, non-polar column, isothermal

View large format table.

Column type Active phase Temperature (C) I Reference Comment
PackedApiezon M130.746.Garbuzov, Misharina, et al., 1985He or N2, Chromosorb W, AW-DMCS; Column length: 2.1 m

Normal alkane RI, non-polar column, custom temperature program

View large format table.

Column type Active phase I Reference Comment
CapillaryApiezon M746.N/AProgram: not specified
CapillaryApiezon M746.Liu, Cao, et al., 2005Program: not specified
CapillaryPolydimethyl siloxanes739.Zenkevich, 1998Program: not specified
CapillarySE-52754.van Langenhove and Schamp, 1986Column length: 100. m; Column diameter: 0.50 mm; Program: not specified

References

Mackle and Mayrick, 1962
Mackle, H.; Mayrick, R.G.,
Studies in the thermochemistry of organic sulphides. Part 2. The gas-phase heats of formation of ten aliphatic sulphides,
Trans. Faraday Soc., 1962, 58, 230-237. [all data]
Mcallan, Cullum, et al., 1951
Mcallan, D.T.; Cullum, T.V.; Dean, R.A.; Fidler, F.A.,
The Preparation and Properties of Sulfur Compounds Related to Petroleum I. The Dialkyl Sulfides and Disulfides,
J. Am. Chem. Soc., 1951, 73, 3627-32. [all data]
Ingold, Jessop, et al., 1933
Ingold; Jessop; Kuriyam; Mandour,
Influence of Poles and Polar Linkages on the Course Pursued by Elimination Reactions XVIII. Thermal Decompostion of Sulphoniumm Hydroxides,
J. Chem. Soc., 1933, 1933, 3455. [all data]
Shimizu, Saito, et al., 1981
Shimizu, M.; Saito, Y.; Kusano, K.,
, Preprints 17th Conf. Chem. Thermodyn. Thermal Anal., Japan, 1981, 50. [all data]
Reid, 1972
Reid, Robert C.,
Handbook on vapor pressure and heats of vaporization of hydrocarbons and related compounds, R. C. Wilhort and B. J. Zwolinski, Texas A Research Foundation. College Station, Texas(1971). 329 pages.$10.00,
AIChE J., 1972, 18, 6, 1278-1278, https://doi.org/10.1002/aic.690180637
. [all data]
Mackle and McClean, 1964
Mackle, H.; McClean, R.T.B.,
Measurement of vaporization heats by the method of gas-liquid chromatography. Part 2,
Trans. Faraday Soc., 1964, 60, 817, https://doi.org/10.1039/tf9646000817
. [all data]
Dykyj, Svoboda, et al., 1999
Dykyj, J.; Svoboda, J.; Wilhoit, R.C.; Frenkel, M.L.; Hall, K.R.,
Vapor Pressure of Chemicals: Part A. Vapor Pressure and Antoine Constants for Hydrocarbons and Sulfur, Selenium, Tellurium and Hydrogen Containing Organic Compounds, Springer, Berlin, 1999, 373. [all data]
Stephenson and Malanowski, 1987
Stephenson, Richard M.; Malanowski, Stanislaw,
Handbook of the Thermodynamics of Organic Compounds, 1987, https://doi.org/10.1007/978-94-009-3173-2
. [all data]
White, Barnard--Smith, et al., 1952
White, P.T.; Barnard--Smith, D.G.; Fidler, F.A.,
Vapor Pressure--Temperature Relationships of Sulfur Compounds Related to Petroleum,
Ind. Eng. Chem., 1952, 44, 6, 1430-1438, https://doi.org/10.1021/ie50510a064
. [all data]
Mackle and Mayrick, 1962, 2
Mackle, H.; Mayrick, R.G.,
Studies in the thermochemistry of organic sulphides. Part 2.?The gas-phase heats of formation of ten aliphatic sulphides,
Trans. Faraday Soc., 1962, 58, 230, https://doi.org/10.1039/tf9625800230
. [all data]
Trofimov, Mel'der, et al., 1975
Trofimov, B.A.; Mel'der, U.K.; Pikver, R.I.; Vyalykh, E.P.,
Ionization potentials of unsaturated and sulfides the participation of neighboring multiple bonds of heteroatoms in the stabilization of the radical cation,
Teor. Eksp. Khim., 1975, 11, 129. [all data]