Cyclopentane, 1-bromo-2-fluoro-, cis-
- Formula: C5H8BrF
- Molecular weight: 167.019
- IUPAC Standard InChIKey: GITCXTAKUHIPRH-CRCLSJGQSA-N
- CAS Registry Number: 51422-72-1
- Chemical structure:
View 3d structure (requires JavaScript / HTML 5) - Stereoisomers:
- Other names: cis-1-Bromo-2-Fluorocyclopentane

Gas phase ion energetics data

Data compiled by: Sharon G. Lias, Rhoda D. Levin, and Sherif A. Kafafi
Ionization energy determinations
IE (eV) | Method | Reference |
---|---|---|
10.10 ± 0.02 | PE | Botter, Menes, et al., 1973 |

References

Botter, Menes, et al., 1973
Botter, R.; Menes, F.; Gounelle, Y.; Pechine, J.M.; Solgadi, D.,
The ionization potentials of geometrical isomers: the cis and trans 2-subststituted cyclopentyl and cyclohexyl bromides,
Int. J. Mass Spectrom. Ion Phys., 1973, 12, 188. [all data]