Ethene, tetraiodo-
- Formula: C2I4
- Molecular weight: 531.6393
- IUPAC Standard InChIKey: ZGQURDGVBSSDNF-UHFFFAOYSA-N
- CAS Registry Number: 513-92-8
- Chemical structure:
View 3d structure (requires JavaScript / HTML 5) - Other names: Ethylene, tetraiodo-; Ethylene periodide; Ethylene tetraiodide; Periodoethene; Tetraiodoethylene

Gas phase ion energetics data

Data compiled as indicated in comments:
LBLHLM - Sharon G. Lias, John E. Bartmess, Joel F. Liebman, John L. Holmes, Rhoda D. Levin, and W. Gary Mallard
LLK - Sharon G. Lias, Rhoda D. Levin, and Sherif A. Kafafi
Ionization energy determinations
IE (eV) | Method | Reference | Comment |
---|---|---|---|
8.6 | PE | Potts, Novak, et al., 1983 | LBLHLM |
8.5 | PE | Jonkers, Van Der Kerk, et al., 1982 | LBLHLM |
8.65 ± 0.02 | PE | Jonkers, Van Der Kerk, et al., 1982 | LBLHLM |
8.3 | PE | Novak, Cvitas, et al., 1981 | LLK |
8.52 | PE | Novak, Cvitas, et al., 1981 | Vertical value; LLK |

References

Potts, Novak, et al., 1983
Potts, A.W.; Novak, I.; Lyus, M.L.,
The valence shell electronic structure and UV photoelectron spectra of the tetrahaloethylenes,
J. Electron Spectrosc. Relat. Phenom., 1983, 31, 57. [all data]
Jonkers, Van Der Kerk, et al., 1982
Jonkers, G.; Van Der Kerk, S.M.; Mooyman, R.; De Lange, C.A.; Snijders, J.G.,
He(I) photoelectron spectroscopy of tetraiodoethylene (C2I4),
Chem. Phys., 1982, 69, 115. [all data]
Novak, Cvitas, et al., 1981
Novak, I.; Cvitas, T.; Klasinc, L.,
Photoelectron spectrum of tetraiodomethane,
Chem. Phys. Lett., 1981, 79, 154. [all data]