2,3-Butanediol
- Formula: C4H10O2
- Molecular weight: 90.1210
- IUPAC Standard InChIKey: OWBTYPJTUOEWEK-UHFFFAOYSA-N
- CAS Registry Number: 513-85-9
- Chemical structure:
View 3d structure (requires JavaScript / HTML 5) - Species with the same structure:
- Stereoisomers:
- Other names: Butane-2,3-diol; Dimethylethylene glycol; 2,3-Butylene glycol; 2,3-Dihydroxybutane; D-2,3-Butane diol; 2,3-Butandiol; 2,3-Butanediol, isomer 1; 2,3-butanodiol; 2.3-Butanediol, isomer 3; 2,3-Butanediol, isomer 2

Phase change data

Data compiled as indicated in comments:
BS - Robert L. Brown and Stephen E. Stein
TRC - Thermodynamics Research Center, NIST Boulder Laboratories, Chris Muzny director
AC - William E. Acree, Jr., James S. Chickos
Quantity | Value | Units | Method | Reference | Comment |
---|---|---|---|---|---|
Tboil | 456.7 | K | N/A | Aldrich Chemical Company Inc., 1990 | BS |
Tboil | 455.65 | K | N/A | Mellan, 1962 | Uncertainty assigned by TRC = 1. K; TRC |
Tboil | 455.15 | K | N/A | Walpole, 1911 | Uncertainty assigned by TRC = 4. K; TRC |
Tboil | 415.15 | K | N/A | Sabatier and Mailhe, 1907 | Uncertainty assigned by TRC = 3. K; TRC |
Quantity | Value | Units | Method | Reference | Comment |
Tfus | 292.15 | K | N/A | Mellan, 1962 | Uncertainty assigned by TRC = 2. K; TRC |
Enthalpy of vaporization
ΔvapH (kJ/mol) | Temperature (K) | Method | Reference | Comment |
---|---|---|---|---|
62.5 | 363. | A | Stephenson and Malanowski, 1987 | Based on data from 348. to 457. K.; AC |
58.4 | 332. | N/A | Stull, 1947 | Based on data from 317. to 455. K.; AC |
57.9 | 378. | N/A | Schierholtz and Staples, 1935 | Based on data from 353. to 403. K.; AC |
55.7 | 380. | N/A | Schierholtz and Staples, 1935 | Based on data from 303. to 456. K.; AC |
Antoine Equation Parameters
log10(P) = A − (B / (T + C))
P = vapor pressure (bar)
T = temperature (K)
View plot Requires a JavaScript / HTML 5 canvas capable browser.
Temperature (K) | A | B | C | Reference | Comment |
---|---|---|---|---|---|
317. to 455. | 6.07439 | 2616.746 | -24.565 | Stull, 1947 | Coefficents calculated by NIST from author's data. |

Reaction thermochemistry data

Data compiled by: Hussein Y. Afeefy, Joel F. Liebman, and Stephen E. Stein
Individual Reactions
By formula: C8H14O4 + 2H2O = C4H10O2 + 2C2H4O2
Quantity | Value | Units | Method | Reference | Comment |
---|---|---|---|---|---|
ΔrH° | -22.3 ± 2.1 | kJ/mol | Cm | Shlechter, Othmer, et al., 1945 | liquid phase; Heat of formation derived by Cox and Pilcher, 1970 |
By formula: C4H10O2 + 2C2H4O2 = C8H14O4 + 2H2O
Quantity | Value | Units | Method | Reference | Comment |
---|---|---|---|---|---|
ΔrH° | 22.30 | kJ/mol | Eqk | Shlechter, Othmer, et al., 1945 | liquid phase; Heat of esterification at 338-453 K |

Gas phase ion energetics data

Data compiled as indicated in comments:
LL - Sharon G. Lias and Joel F. Liebman
LBLHLM - Sharon G. Lias, John E. Bartmess, Joel F. Liebman, John L. Holmes, Rhoda D. Levin, and W. Gary Mallard
Appearance energy determinations
Ion | AE (eV) | Other Products | Method | Reference | Comment |
---|---|---|---|---|---|
C2H4O+ | 10.26 | C2H4O | EI | Holmes, Lossing, et al., 1991 | LL |
C2H5O+ | 10.26 ± 0.05 | CH3CHOH | EI | Holmes and Lossing, 1984 | LBLHLM |
C2H7O+ | 10.00 ± 0.05 | C2H3O | EI | Sirois, George, et al., 1994 | LL |

Condensed phase thermochemistry data

Data compiled as indicated in comments:
ALS - Hussein Y. Afeefy, Joel F. Liebman, and Stephen E. Stein
DH - Eugene S. Domalski and Elizabeth D. Hearing
Quantity | Value | Units | Method | Reference | Comment |
---|---|---|---|---|---|
ΔfH°liquid | -130.2 | kcal/mol | Ccb | Baroody and Carpenter, 1972 | ALS |
ΔfH°liquid | -129.5 | kcal/mol | Ccb | Moureu and Dode, 1937 | ALS |
Quantity | Value | Units | Method | Reference | Comment |
ΔcH°liquid | -588.3 | kcal/mol | Ccb | Moureu and Dode, 1937 | Corresponding ΔfHºliquid = -129.5 kcal/mol (simple calculation by NIST; no Washburn corrections); ALS |
Constant pressure heat capacity of liquid
Cp,liquid (cal/mol*K) | Temperature (K) | Reference | Comment |
---|---|---|---|
50.91 | 298.2 | Khokhlovkin and Kalacheva, 1936 | T = 26 to 140°C.; DH |

Kovats' RI, polar column, temperature ramp

Column type | Active phase | I | Reference | Comment |
---|---|---|---|---|
Capillary | Carbowax 20M | 1494. | Nishimura, Yamaguchi, et al., 1989 | 2. K/min; Column length: 50. m; Column diameter: 0.22 mm; Tstart: 80. C; Tend: 200. C |
Capillary | Carbowax 20M | 1492. | Toda, Mihara, et al., 1983 | 2. K/min; Column length: 50. m; Column diameter: 0.23 mm; Tstart: 80. C; Tend: 200. C |
Capillary | Carbowax 20M | 1492. | Toda, Mihara, et al., 1983 | 2. K/min; Column length: 50. m; Column diameter: 0.23 mm; Tstart: 80. C; Tend: 200. C |
Capillary | Carbowax 20M | 1522. | Toda, Mihara, et al., 1983 | 2. K/min; Column length: 50. m; Column diameter: 0.23 mm; Tstart: 80. C; Tend: 200. C |
Capillary | Carbowax 20M | 1526. | Toda, Mihara, et al., 1983 | 2. K/min; Column length: 50. m; Column diameter: 0.23 mm; Tstart: 80. C; Tend: 200. C |

Van Den Dool and Kratz RI, non-polar column, temperature ramp

Column type | Active phase | I | Reference | Comment |
---|---|---|---|---|
Capillary | SPB-5 | 789. | Engel and Ratel, 2007 | 60. m/0.32 mm/1. μm, 40. C @ 2. min, 3. K/min, 230. C @ 10. min |
Capillary | SPB-5 | 773. | Pino, Marbot, et al., 2004 | 30. m/0.25 mm/0.25 μm, He, 60. C @ 2. min, 4. K/min, 250. C @ 20. min |
Capillary | DB-1 | 747.5 | Sun and Stremple, 2003 | 30. m/0.25 mm/0.25 μm, He, 3. K/min; Tstart: 40. C; Tend: 325. C |
Capillary | CP-Sil 8CB-MS | 769. | Bruna, Hierro, et al., 2001 | 60. m/0.25 mm/0.25 μm, 40. C @ 2. min, 4. K/min; Tend: 280. C |
Capillary | HP-5MS | 802. | Kim, Shin, et al., 2001 | 30. m/0.25 mm/0.25 μm, He, 40. C @ 5. min, 2. K/min, 200. C @ 20. min |
Capillary | HP-5MS | 819. | Kim, Shin, et al., 2001 | 30. m/0.25 mm/0.25 μm, He, 40. C @ 5. min, 2. K/min, 200. C @ 20. min |

Van Den Dool and Kratz RI, non-polar column, custom temperature program

Column type | Active phase | I | Reference | Comment |
---|---|---|---|---|
Capillary | DB-5MS | 782. | Boulanger and Crouzet, 2000 | 30. m/0.25 mm/0.25 μm, He; Program: 60 0C (3 min) 2 K/min -> 220 0C 5 K/min -> 250 0C (15 min) |

Van Den Dool and Kratz RI, polar column, temperature ramp

Column type | Active phase | I | Reference | Comment |
---|---|---|---|---|
Capillary | DB-Wax | 1580. | Gurbuz O., Rouseff J.M., et al., 2006 | 60. m/0.25 mm/0.25 μm, He, 7. K/min, 265. C @ 5. min; Tstart: 40. C |
Capillary | DB-Wax | 1545. | Gurbuz O., Rouseff J.M., et al., 2006 | 30. m/0.32 mm/0.5 μm, He, 7. K/min, 265. C @ 5. min; Tstart: 40. C |
Capillary | DB-Wax | 1570. | Osorio, Alarcon, et al., 2006 | 30. m/0.25 mm/0.25 μm, He, 50. C @ 4. min, 4. K/min, 220. C @ 20. min |
Capillary | DB-Wax | 1556. | Malliaa, Fernandez-Garcia, et al., 2005 | 60. m/0.32 mm/1. μm, He, 45. C @ 1. min, 5. K/min, 250. C @ 12. min |
Capillary | DB-Wax | 1542. | Kim T.H., Kim T.H., et al., 2002 | 30. m/0.25 mm/0.25 μm, He, 40. C @ 5. min, 3. K/min, 200. C @ 20. min |
Capillary | DB-Wax | 1539. | Kim, Shin, et al., 2001 | 30. m/0.25 mm/0.25 μm, He, 40. C @ 5. min, 2. K/min, 200. C @ 20. min |
Capillary | DB-Wax | 1543. | Kim, Shin, et al., 2001 | 30. m/0.25 mm/0.25 μm, He, 40. C @ 5. min, 2. K/min, 200. C @ 20. min |
Capillary | DB-FFAP | 1547. | Charles, Martin, et al., 2000 | 30. m/0.32 mm/0.25 μm, H2, 40. C @ 2. min, 5. K/min; Tend: 240. C |
Capillary | Supelcowax-10 | 1543. | Chung, 2000 | 60. m/0.25 mm/0.25 μm, He, 2. K/min, 195. C @ 90. min; Tstart: 35. C |
Capillary | Supelcowax-10 | 1543. | Chung, 1999 | 60. m/0.25 mm/0.25 μm, He, 35. C @ 5. min, 2. K/min, 195. C @ 90. min |
Capillary | DB-Wax | 1541. | Shimoda, Wu, et al., 1996 | 60. m/0.25 mm/0.25 μm, He, 3. K/min; Tstart: 50. C; Tend: 230. C |
Capillary | DB-Wax | 1542. | Iwaoka, Hagi, et al., 1994 | He, 40. C @ 5. min, 2. K/min; Column length: 30. m; Column diameter: 0.25 mm; Tend: 200. C |

Van Den Dool and Kratz RI, polar column, custom temperature program

Column type | Active phase | I | Reference | Comment |
---|---|---|---|---|
Capillary | DB-Wax | 1583. | Selli, Canbas, et al., 2006 | 30. m/0.32 mm/0.5 μm, H2; Program: 60C(3min) => 2C/min => 220C => 3C/min => 245C (20min) |
Capillary | DB-Wax | 1583. | Selli, Canbas, et al., 2006, 2 | 30. m/0.32 mm/0.5 μm, H2; Program: 60C(3min) => 2C/min => 220C => 3C/min => 245C(20min) |
Capillary | DB-Wax | 1579. | Nurgel, Erten, et al., 2002 | 30. m/0.32 mm/0.5 μm, H2; Program: 60C (3min) => 2C/min => 220C => 3C/min => 245C (20min) |

Normal alkane RI, non-polar column, temperature ramp

Column type | Active phase | I | Reference | Comment |
---|---|---|---|---|
Capillary | HP-5 | 795. | Piyachaiseth, Jirapakkul, et al., 2011 | 60. m/0.25 mm/0.25 μm, Helium, 35. C @ 1. min, 10. K/min, 220. C @ 15. min |
Capillary | SPB-5 | 789. | Sivadier, Ratel, et al., 2009 | 60. m/0.32 mm/1.00 μm, 40. C @ 5. min, 3. K/min, 230. C @ 10. min |
Capillary | DB-5 | 806. | Ozel, Gogus, et al., 2006 | 30. m/0.32 mm/0.25 μm, He, 60. C @ 0.5 min, 5. K/min, 280. C @ 2. min |
Capillary | DB-5 MS | 803. | Schirack, Drake, et al., 2006 | 30. m/0.25 mm/0.25 μm, 40. C @ 3. min, 8. K/min, 200. C @ 20. min |
Capillary | HP-5MS | 782. | Krist, Stuebiger, et al., 2005 | 30. m/0.25 mm/0.25 μm, 38. C @ 1. min, 5. K/min, 220. C @ 2. min |
Capillary | OV-101 | 824. | Zenkevich, 2005 | 25. m/0.20 mm/0.10 μm, N2/He, 6. K/min; Tstart: 50. C; Tend: 250. C |
Capillary | SPB-5 | 783. | Sebastian, Viallon-Fernandez, et al., 2003 | 60. m/0.32 mm/1.0 μm, Helium, 3. K/min; Tstart: 30. C; Tend: 230. C |
Capillary | DB-5 | 779. | Joffraud, Leroi, et al., 2001 | 60. m/0.32 mm/1. μm, He, 40. C @ 5. min, 3. K/min; Tend: 200. C |
Capillary | RSL-200 | 780. | Ngassoum, Jirovetz, et al., 2001 | 30. m/0.32 mm/0.25 μm, H2, 40. C @ 5. min, 6. K/min, 280. C @ 5. min |
Capillary | DB-5 | 790. | Meynier, Novelli, et al., 1999 | 30. m/0.32 mm/1. μm, 40. C @ 5. min, 3. K/min; Tend: 200. C |
Capillary | DB-1 | 756. | Buttery, Ling, et al., 1997 | 30. C @ 25. min, 4. K/min, 200. C @ 20. min; Column length: 60. m; Column diameter: 0.25 mm |
Capillary | DB-5 | 779. | Kondjoyan, Viallon, et al., 1997 | 60. m/0.32 mm/1. μm, 40. C @ 5. min, 3. K/min, 200. C @ 2. min |
Capillary | DB-5 | 782. | Kondjoyan, Viallon, et al., 1997 | 60. m/0.32 mm/1. μm, 40. C @ 5. min, 3. K/min, 200. C @ 2. min |
Capillary | DB-1 | 768. | Buttery, Stern, et al., 1994 | He, 30. C @ 25. min, 4. K/min, 200. C @ 20. min; Column length: 60. m; Column diameter: 0.32 mm |
Capillary | DB-1 | 746. | Hansen, Buttery, et al., 1992 | 30. C @ 25. min, 4. K/min, 200. C @ 20. min; Column length: 60. m; Column diameter: 0.32 mm |
Capillary | DB-1 | 750. | Peppard, 1992 | 30. m/0.25 mm/1.0 μm, He, 3. K/min, 250. C @ 30. min; Tstart: 40. C |

Normal alkane RI, non-polar column, custom temperature program

Column type | Active phase | I | Reference | Comment |
---|---|---|---|---|
Capillary | DB-5 | 767. | da Fonseca, Bizerra, et al., 2009 | 30. m/0.25 mm/0.25 μm, Hydrogen; Program: 35 0C 4 0C/min -> 180 0C 17 0C/min -> 280 0C (10 min) |
Capillary | HP-5 | 787. | Ventanas, Estevez, et al., 2008 | 50. m/0.32 mm/1.05 μm, Helium; Program: 40 0C (10 min) 5 0C/min -> 200 0C 15 0C/min -> 250 0C (10 min) |
Capillary | DB-5 MS | 792. | Cajka, Hajslova, et al., 2007 | 30. m/0.25 mm/0.25 μm, Helium; Program: 45 0C (0.75 min) 10 0C/min -> 200 0C 30 0C/min -> 245 0C (1.25 min) |
Capillary | HP-5 | 788. | Splivallo, Bossi, et al., 2007 | He; Program: 50C => 3C/min => 200C(10min) => 10C/min => 290C(10min) |
Capillary | BP-5 | 793. | Helsper, Bücking, et al., 2006 | 30. m/0.25 mm/1. μm, He; Program: 40C(2min) => 4C/min => 150C => 8C/min => 250C (15min) |
Capillary | HP-5MS | 793. | Alissandrakis, Kibaris, et al., 2005 | 30. m/0.25 mm/0.25 μm, He; Program: 40C(3min) => 2C/min => 180C => 10C/min => 250C(5min) |
Capillary | BPX-5 | 800. | Duflos, Moine, et al., 2005 | 60. m/0.25 mm/0.25 μm, He; Program: 40C(5min) => 5C/min => 100C => 20C/min => 280C (5min) |
Capillary | HP-5 | 806. | Jordán, Margaría, et al., 2003 | 30. m/0.25 mm/0.25 μm; Program: 40C(6min) => 2.5C/min => 150C => 90C/min => 250C |
Capillary | HP-5 | 782. | Jordán, Goodner, et al., 2002 | 30. m/0.25 mm/0.25 μm; Program: not specified |
Capillary | HP-5 | 778. | Jordán, Goodner, et al., 2002 | 30. m/0.25 mm/0.25 μm; Program: not specified |
Capillary | HP-5 | 784. | Timón, Ventanas, et al., 1998 | 50. m/0.32 mm/0.52 μm, He; Program: 35 0C 10 0C/min -> 200 0C (20 min) 5 0C/min -> 230 0C (50 min) |
Capillary | DB-5 | 793. | Mateo, Aguirrezábal, et al., 1997 | 50. m/0.32 mm/0.25 μm, He; Program: 40C(10min) => 3C/min => 95C => 10C/min => 270C(10min) |
Capillary | DB-5 | 786. | Mateo and Zumalacárregui, 1996 | 50. m/0.32 mm/0.25 μm, He; Program: 40C (10min) => 3C/min => 95C => 10C/min => 270C (10min) |

Normal alkane RI, polar column, temperature ramp

Column type | Active phase | I | Reference | Comment |
---|---|---|---|---|
Capillary | HP-FFAP | 1558. | Wanakhachornkrai and Lertsiri, 9999 | 25. m/0.32 mm/0.50 μm, Helium, 15. K/min; Tstart: 45. C; Tend: 220. C |
Capillary | DB-FFAP | 1562. | Osorio, Carriazo, et al., 2011 | 30. m/0.32 mm/0.25 μm, Helium, 50. C @ 4. min, 4. K/min, 250. C @ 5. min |
Capillary | FFAP | 1522. | Piyachaiseth, Jirapakkul, et al., 2011 | 60. m/0.25 mm/0.25 μm, Helium, 45. C @ 1. min, 5. K/min, 220. C @ 5. min |
Capillary | DB-Wax | 1541. | Lan Phi N.T., Nishiyama C., et al., 2006 | 60. m/0.25 mm/0.25 μm, 70. C @ 2. min, 2. K/min, 230. C @ 20. min |
Capillary | DB-Wax | 1576. | Lan Phi N.T., Nishiyama C., et al., 2006 | 60. m/0.25 mm/0.25 μm, 70. C @ 2. min, 2. K/min, 230. C @ 20. min |
Capillary | DB-Wax | 1554. | Schirack, Drake, et al., 2006 | 30. m/0.25 mm/0.25 μm, 40. C @ 3. min, 8. K/min, 200. C @ 20. min |
Capillary | DB-Wax | 1580. | Chida, Sone, et al., 2004 | 60. m/0.25 mm/0.5 μm, 35. C @ 5. min, 4. K/min, 240. C @ 10. min |
Capillary | DB-Wax | 1542. | Lee and Noble, 2003 | 30. m/0.25 mm/0.25 μm, He, 40. C @ 4. min, 4. K/min, 185. C @ 20. min |
Capillary | HP-FFAP | 1558. | Wanakhachornkrai and Lertsiri, 2003 | 25. m/0.32 mm/0.5 μm, He, 15. K/min; Tstart: 45. C; Tend: 220. C |
Capillary | DB-Wax | 1523. | Wei, Mura, et al., 2001 | 60. m/0.25 mm/0.25 μm, He, 2. K/min; Tstart: 40. C; Tend: 200. C |
Capillary | DB-Wax | 1566. | Franco and Shibamoto, 2000 | He, 50. C @ 8. min, 3. K/min; Column length: 30. m; Column diameter: 0.2 mm; Tend: 180. C |
Capillary | DB-Wax | 1539. | Buttery, Orts, et al., 1999 | 30. C @ 4. min, 2. K/min, 170. C @ 60. min; Column length: 60. m; Column diameter: 0.32 mm |
Capillary | DB-Wax | 1539. | Buttery and Ling, 1998 | 30. C @ 4. min, 2. K/min, 170. C @ 30. min; Column length: 60. m; Column diameter: 0.25 mm |
Capillary | DB-Wax | 1526. | Pollak and Berger, 1996 | 30. m/0.32 mm/0.5 μm, He, 40. C @ 1. min, 3. K/min, 210. C @ 25. min |
Capillary | DB-Wax | 1517. | Christensen and Reineccius, 1995 | 30. m/0.25 mm/0.25 μm, 20. C @ 1. min, 5. K/min; Tend: 230. C |
Capillary | DB-Wax | 1512. | Hatsuko, Kazuko, et al., 1992 | He, 60. C @ 10. min, 3. K/min; Column length: 30. m; Column diameter: 0.25 mm; Tend: 240. C |
Capillary | DB-Wax | 1529. | Takeoka and Butter, 1989 | 60. m/0.32 mm/0.25 μm, He, 30. C @ 4. min, 2. K/min; Tend: 180. C |
Capillary | DB-Wax | 1536. | Takeoka and Butter, 1989 | 60. m/0.32 mm/0.25 μm, He, 30. C @ 4. min, 2. K/min; Tend: 180. C |
Capillary | Carbowax 20M | 1590. | Buttery, Kamm, et al., 1984 | 1. K/min, 170. C @ 30. min; Column length: 150. m; Column diameter: 0.64 mm; Tstart: 50. C |

Normal alkane RI, polar column, custom temperature program

Column type | Active phase | I | Reference | Comment |
---|---|---|---|---|
Capillary | DB-Wax | 1563. | Welke, Manfroi, et al., 2012 | 30. m/0.25 mm/0.25 μm, Helium; Program: not specified |
Capillary | DB-Wax | 1583. | Welke, Manfroi, et al., 2012 | 30. m/0.25 mm/0.25 μm, Helium; Program: not specified |
Capillary | HP-Innowax | 1553. | Xiao, Dai, et al., 2011 | 60. m/0.25 mm/0.25 μm, Helium; Program: 40 0C (2 min) 3 0C/min -> 150 0C 5 0C/min -> 220 0C (5 min) |
Capillary | PEG 20M | 1581. | Zhang, Zhang, et al., 2008 | 30. m/0.25 mm/0.25 μm, Helium; Program: 40 0C (3 min) 5 0C/min -> 60 0C 6 0C/min -> 130 0C 10 0C/min -> 230 0C |
Capillary | DB-Wax | 1524. | Selli, 2007 | 30. m/0.32 mm/0.50 μm, Hydrogen; Program: 60 0C (3 min) 2 0C/min -> 220 0C 3 0C/min -> 245 0C (20 min) |
Capillary | PEG-20M | 1581. | Zhang C., Zhang H., et al., 2007 | 30. m/0.25 mm/0.25 μm; Program: 40C(3min) => 5C/min => 60C => 6C/min => 130C => 10C/min => 230C (10min) |
Capillary | Supelcowax-10 | 1550. | Kourkoutas, Bosnea, et al., 2006 | 60. m/0.32 mm/0.25 μm, He; Program: 35C(3min) => 5C/min => 110C => 10C/min => 240C (10min) |
Capillary | DB-Wax | 1528. | Krings, Zelena, et al., 2006 | 30. m/0.32 mm/0.25 μm, He; Program: 45C(5min) => 5C/min => 150C => 10C/min => 240C (10min) |
Capillary | HP-Innowax | 1577. | Piasenzotto, Gracco, et al., 2003 | 30. m/0.32 mm/0.5 μm, He; Program: 50C(4min) => 10C/min => 230C(10min) => 10C/min => 250C |
Capillary | DB-Wax | 1521. | Hatsuko, Kazuko, et al., 1992 | He; Column length: 30. m; Column diameter: 0.25 mm; Program: not specified |
Capillary | Supelcowax-10 | 1583. | Miranda-Lopez, Libbey, et al., 1992 | 30. m/0.53 mm/0.25 μm; Program: 80C(5min) => 5C/min => 155C => 4C/min => 240C(30min) |

Henry's Law data

Data compiled by: Rolf Sander
Henry's Law constant (water solution)
kH(T) = k°H exp(d(ln(kH))/d(1/T) ((1/T) - 1/(298.15 K)))
k°H = Henry's law constant for solubility in water at 298.15 K (mol/(kg*bar))
d(ln(kH))/d(1/T) = Temperature dependence constant (K)
k°H (mol/(kg*bar)) | d(ln(kH))/d(1/T) (K) | Method | Reference | Comment |
---|---|---|---|---|
>40000. | E | N/A | Value obtained by missing citation using the group contribution method. | |
<4.0×10+6 | E | N/A | Value obtained by missing citation using the group contribution method. |

References

Aldrich Chemical Company Inc., 1990
Aldrich Chemical Company Inc.,
Catalog Handbook of Fine Chemicals, Aldrich Chemical Company, Inc., Milwaukee WI, 1990, 1. [all data]
Mellan, 1962
Mellan, I.,
Polyhydric Alcohols, Spartan Books: Washington, DC, 1962. [all data]
Walpole, 1911
Walpole, G.S.,
Proc. R. Soc. London, B, 1911, 83, 272. [all data]
Sabatier and Mailhe, 1907
Sabatier, P.; Mailhe, A.,
The Direct Hydrogenation of Methyl Diketones,
C. R. Hebd. Seances Acad. Sci., 1907, 144, 1086. [all data]
Stephenson and Malanowski, 1987
Stephenson, Richard M.; Malanowski, Stanislaw,
Handbook of the Thermodynamics of Organic Compounds, 1987, https://doi.org/10.1007/978-94-009-3173-2
. [all data]
Stull, 1947
Stull, Daniel R.,
Vapor Pressure of Pure Substances. Organic and Inorganic Compounds,
Ind. Eng. Chem., 1947, 39, 4, 517-540, https://doi.org/10.1021/ie50448a022
. [all data]
Schierholtz and Staples, 1935
Schierholtz, O.J.; Staples, M.L.,
Vapor Pressures of Certain Glycols,
J. Am. Chem. Soc., 1935, 57, 12, 2709-2711, https://doi.org/10.1021/ja01315a106
. [all data]
Shlechter, Othmer, et al., 1945
Shlechter, N.; Othmer, D.F.; Marshak, S.,
Esterification of 2,3-butylene glycol with acetic acid,
Ind. Eng. Chem., 1945, 37, 900-905. [all data]
Cox and Pilcher, 1970
Cox, J.D.; Pilcher, G.,
Thermochemistry of Organic and Organometallic Compounds, Academic Press, New York, 1970, 1-636. [all data]
Holmes, Lossing, et al., 1991
Holmes, J.L.; Lossing, F.P.; Mayer, P.M.,
Heats of formation of oxygen-containing organic free radicals from appearance energy measurements,
J. Am. Chem. Soc., 1991, 113, 9723. [all data]
Holmes and Lossing, 1984
Holmes, J.L.; Lossing, F.P.,
Heats of formation of organic radicals from appearance energies,
Int. J. Mass Spectrom. Ion Processes, 1984, 58, 113. [all data]
Sirois, George, et al., 1994
Sirois, M.; George, M.; Holmes, J.L.,
Neutral counterparts of the C2H7O+ isomers,
Org. Mass Spectrom., 1994, 29, 11. [all data]