1,3-Butadiene, 2,3-dimethyl-
- Formula: C6H10
- Molecular weight: 82.1436
- IUPAC Standard InChIKey: SDJHPPZKZZWAKF-UHFFFAOYSA-N
- CAS Registry Number: 513-81-5
- Chemical structure:
View 3d structure (requires JavaScript / HTML 5) - Other names: Biisopropenyl; Diisopropenyl; 2,3-Dimethyl-1,3-butadiene; 2,3-Dimethylbuta-1,3-diene; 2,3-Dimethylbutadiene; CH2=C(CH3)C(CH3)=CH2; 2,3-Dimethylenebutane

Gas phase thermochemistry data

Data compiled by: Glushko Thermocenter, Russian Academy of Sciences, Moscow
Constant pressure heat capacity of gas
Cp,gas (J/mol*K) | Temperature (K) | Reference | Comment |
---|---|---|---|
117.9 | 273.15 | Durig J.R., 1979 | It should be noted that values of S(T) and Cp(T) calculated by Durig et al. [ Durig J.R., 1980, Durig J.R., 1980, 2, Durig J.R., 1981] for alkenes are different from experimental ones and given in TRC Tables [ Thermodynamics Research Center, 1997] by 3-5 J/mol*K. So the accuracy of their data could exceed 2 J/mol*K. |
127. ± 2. | 298.15 | ||
127.1 | 300. | ||
159.9 | 400. | ||
188.5 | 500. | ||
212.3 | 600. | ||
232.2 | 700. | ||
249.0 | 800. | ||
263.4 | 900. | ||
275.8 | 1000. |

Condensed phase thermochemistry data

Data compiled by: Hussein Y. Afeefy, Joel F. Liebman, and Stephen E. Stein
Quantity | Value | Units | Method | Reference | Comment |
---|---|---|---|---|---|
ΔcH°liquid | -3815. | kJ/mol | Ccb | Handrick, 1956 | Kogerman, P. N., 1934; Corresponding ΔfHºliquid = 24. kJ/mol (simple calculation by NIST; no Washburn corrections) |

Phase change data

Data compiled as indicated in comments:
BS - Robert L. Brown and Stephen E. Stein
TRC - Thermodynamics Research Center, NIST Boulder Laboratories, Chris Muzny director
ALS - Hussein Y. Afeefy, Joel F. Liebman, and Stephen E. Stein
AC - William E. Acree, Jr., James S. Chickos
Quantity | Value | Units | Method | Reference | Comment |
---|---|---|---|---|---|
Tboil | 342. ± 3. | K | AVG | N/A | Average of 12 values; Individual data points |
Quantity | Value | Units | Method | Reference | Comment |
Tfus | 197.1200 | K | N/A | Streiff, Soule, et al., 1950 | Uncertainty assigned by TRC = 0.05 K; TRC |
Tfus | 197.1300 | K | N/A | Streiff, Soule, et al., 1950 | Uncertainty assigned by TRC = 0.03 K; TRC |
Tfus | 197.1400 | K | N/A | Streiff, Soule, et al., 1950 | Uncertainty assigned by TRC = 0.02 K; TRC |
Tfus | 197.2 | K | N/A | Dolliver, Gresham, et al., 1937 | Uncertainty assigned by TRC = 0.5 K; TRC |
Tfus | 208. | K | N/A | Enklaar, 1917 | Uncertainty assigned by TRC = 10. K; TRC |
Quantity | Value | Units | Method | Reference | Comment |
ΔvapH° | 31. | kJ/mol | V | Rogers, 1972 | ALS |
Enthalpy of vaporization
ΔvapH (kJ/mol) | Temperature (K) | Method | Reference | Comment |
---|---|---|---|---|
32.2 | 288. | A | Stephenson and Malanowski, 1987 | Based on data from 273. to 342. K. See also Bevan, Malkin, et al., 1955.; AC |
Antoine Equation Parameters
log10(P) = A − (B / (T + C))
P = vapor pressure (bar)
T = temperature (K)
View plot Requires a JavaScript / HTML 5 canvas capable browser.
Temperature (K) | A | B | C | Reference | Comment |
---|---|---|---|---|---|
273.19 to 341.6 | 4.27218 | 1315.15 | -33.416 | Cummings and McLaughlin, 1955 | Coefficents calculated by NIST from author's data. |

Reaction thermochemistry data

Data compiled as indicated in comments:
ALS - Hussein Y. Afeefy, Joel F. Liebman, and Stephen E. Stein
B - John E. Bartmess
Individual Reactions
By formula: 2H2 + C6H10 = C6H14
Quantity | Value | Units | Method | Reference | Comment |
---|---|---|---|---|---|
ΔrH° | -231.4 ± 3.0 | kJ/mol | Chyd | Molnar, Rachford, et al., 1984 | liquid phase; solvent: Dioxane; ALS |
ΔrH° | -227.0 ± 2.8 | kJ/mol | Chyd | Molnar, Rachford, et al., 1984 | liquid phase; solvent: Hexane; ALS |
ΔrH° | -223.4 ± 0.63 | kJ/mol | Chyd | Dolliver, Gresham, et al., 1937, 2 | gas phase; Reanalyzed by Cox and Pilcher, 1970, Original value = -225.4 ± 0.63 kJ/mol; At 355 °K; ALS |
C6H9- + =
By formula: C6H9- + H+ = C6H10
Quantity | Value | Units | Method | Reference | Comment |
---|---|---|---|---|---|
ΔrH° | 1624. ± 13. | kJ/mol | G+TS | Clifford, Wenthold, et al., 1998 | gas phase; B |
Quantity | Value | Units | Method | Reference | Comment |
ΔrG° | 1590. ± 13. | kJ/mol | IMRB | Clifford, Wenthold, et al., 1998 | gas phase; B |
+
= C12H10N4
By formula: C6H10 + C6N4 = C12H10N4
Quantity | Value | Units | Method | Reference | Comment |
---|---|---|---|---|---|
ΔrH° | -165.6 ± 1.8 | kJ/mol | Cm | Rogers, 1972 | liquid phase; ALS |
C12H10N4 = +
By formula: C12H10N4 = C6H10 + C6N4
Quantity | Value | Units | Method | Reference | Comment |
---|---|---|---|---|---|
ΔrH° | 165.6 ± 1.8 | kJ/mol | Cm | Rogers, 1972 | solid phase; ALS |

Henry's Law data

Data compiled by: Rolf Sander
Henry's Law constant (water solution)
kH(T) = k°H exp(d(ln(kH))/d(1/T) ((1/T) - 1/(298.15 K)))
k°H = Henry's law constant for solubility in water at 298.15 K (mol/(kg*bar))
d(ln(kH))/d(1/T) = Temperature dependence constant (K)
k°H (mol/(kg*bar)) | d(ln(kH))/d(1/T) (K) | Method | Reference |
---|---|---|---|
0.021 | V | N/A |

Gas phase ion energetics data

Data evaluated as indicated in comments:
HL - Edward P. Hunter and Sharon G. Lias
Data compiled as indicated in comments:
B - John E. Bartmess
LL - Sharon G. Lias and Joel F. Liebman
LLK - Sharon G. Lias, Rhoda D. Levin, and Sherif A. Kafafi
RDSH - Henry M. Rosenstock, Keith Draxl, Bruce W. Steiner, and John T. Herron
Quantity | Value | Units | Method | Reference | Comment |
---|---|---|---|---|---|
Proton affinity (review) | 835.0 | kJ/mol | N/A | Hunter and Lias, 1998 | HL |
Quantity | Value | Units | Method | Reference | Comment |
Gas basicity | 807.8 | kJ/mol | N/A | Hunter and Lias, 1998 | HL |
Ionization energy determinations
IE (eV) | Method | Reference | Comment |
---|---|---|---|
8.66 ± 0.05 | EI | Wolkoff, Holmes, et al., 1980 | LLK |
8.62 ± 0.02 | PE | Bieri, Burger, et al., 1977 | LLK |
8.66 | EI | Lossing and Traeger, 1975 | LLK |
8.62 | PE | Beez, Bieri, et al., 1973 | LLK |
8.54 ± 0.04 | EI | Bock and Seidl, 1968 | RDSH |
8.709 | S | Price and Walsh, 1940 | RDSH |
8.71 | PE | Werstiuk, Clark, et al., 1990 | Vertical value; LL |
8.71 | PE | Masclet, Mouvier, et al., 1981 | Vertical value; LLK |
8.72 | PE | Worley, Webb, et al., 1979 | Vertical value; LLK |
8.76 | PE | Sustmann and Schubert, 1972 | Vertical value; LLK |
Appearance energy determinations
Ion | AE (eV) | Other Products | Method | Reference | Comment |
---|---|---|---|---|---|
C5H7+ | 10.22 ± 0.05 | CH3 | EI | Wolkoff, Holmes, et al., 1980 | LLK |
C5H7+ | 8.66 | CH3 | EI | Lossing and Traeger, 1975, 2 | LLK |
C5H7+ | 10.22 | CH3 | EI | Lossing and Traeger, 1975 | LLK |
De-protonation reactions
C6H9- + =
By formula: C6H9- + H+ = C6H10
Quantity | Value | Units | Method | Reference | Comment |
---|---|---|---|---|---|
ΔrH° | 1624. ± 13. | kJ/mol | G+TS | Clifford, Wenthold, et al., 1998 | gas phase; B |
Quantity | Value | Units | Method | Reference | Comment |
ΔrG° | 1590. ± 13. | kJ/mol | IMRB | Clifford, Wenthold, et al., 1998 | gas phase; B |

Kovats' RI, non-polar column, isothermal

Column type | Active phase | Temperature (C) | I | Reference | Comment |
---|---|---|---|---|---|
Packed | Squalane | 70. | 612. | Safina, Poznyak, et al., 1989 | He, Risorb (0.2-0.3 mm); Column length: 2. m |
Capillary | SE-30 | 130. | 616. | Bredael, 1982 | Column length: 100. m; Column diameter: 0.5 mm |
Capillary | SE-30 | 80. | 616. | Bredael, 1982 | Column length: 100. m; Column diameter: 0.5 mm |
Capillary | Squalane | 50. | 598.1 | Bajus, Veselý, et al., 1979 | Column length: 100. m; Column diameter: 0.25 mm |
Capillary | Squalane | 70. | 598.3 | Bajus, Veselý, et al., 1979 | Column length: 100. m; Column diameter: 0.25 mm |
Packed | Squalane | 27. | 610. | Hively and Hinton, 1968 | He, Chromosorb P; Column length: 15. m; Column diameter: 0.25 mm |
Packed | Squalane | 49. | 611. | Hively and Hinton, 1968 | He, Chromosorb P; Column length: 15. m; Column diameter: 0.25 mm |
Packed | Squalane | 67. | 613. | Hively and Hinton, 1968 | He, Chromosorb P; Column length: 15. m; Column diameter: 0.25 mm |
Packed | Squalane | 86. | 613. | Hively and Hinton, 1968 | He, Chromosorb P; Column length: 15. m; Column diameter: 0.25 mm |

Van Den Dool and Kratz RI, non-polar column, temperature ramp

Column type | Active phase | I | Reference | Comment |
---|---|---|---|---|
Capillary | Petrocol DH | 612. | White, Hackett, et al., 1992 | 100. m/0.25 mm/0.5 μm, He, 1. K/min; Tstart: 30. C; Tend: 220. C |

Normal alkane RI, non-polar column, isothermal

Column type | Active phase | Temperature (C) | I | Reference | Comment |
---|---|---|---|---|---|
Capillary | SE-54 | 50. | 582. | Xieyun, Maoqi, et al., 1996 | N2; Column length: 40. m; Column diameter: 0.25 mm |
Capillary | Squalane | 70. | 612. | Schomburg, 1966 |

Normal alkane RI, non-polar column, temperature ramp

Column type | Active phase | I | Reference | Comment |
---|---|---|---|---|
Capillary | Petrocol DH | 614. | Supelco, 2012 | 100. m/0.25 mm/0.50 μm, Helium, 20. C @ 15. min, 15. K/min, 220. C @ 30. min |
Capillary | OV-101 | 607. | Orav, Kailas, et al., 1999 | 50. m/0.20 mm/0.50 μm, Helium, 30. C @ 6. min, 1. K/min; Tend: 100. C |
Capillary | OV-101 | 612. | Chupalov and Zenkevich, 1996 | N2, 3. K/min; Column length: 52. m; Column diameter: 0.26 mm; Tstart: 50. C; Tend: 220. C |
Capillary | OV-101 | 611. | Zenkevich and Kulikova, 1993 | He, 3. K/min; Column length: 54. m; Column diameter: 0.26 mm; Tstart: 50. C; Tend: 230. C |

Normal alkane RI, non-polar column, custom temperature program

Column type | Active phase | I | Reference | Comment |
---|---|---|---|---|
Capillary | OV-101 | 611. | Zenkevich, 1998 | He; Column length: 25. m; Column diameter: 0.20 mm; Program: not specified |
Capillary | OV-101 | 612. | Zenkevich, 1998 | He; Column length: 25. m; Column diameter: 0.20 mm; Program: not specified |
Capillary | OV-1, SE-30, Methyl silicone, SP-2100, OV-101, DB-1, etc. | 616. | Waggott and Davies, 1984 | Hydrogen; Column length: 50. m; Column diameter: 0.32 mm; Program: not specified |

Normal alkane RI, polar column, temperature ramp

Column type | Active phase | I | Reference | Comment |
---|---|---|---|---|
Capillary | DB-Wax | 757. | Horiuchi, Umano, et al., 1998 | 60. m/0.25 mm/1. μm, He, 3. K/min, 200. C @ 40. min; Tstart: 50. C |

References

Durig J.R., 1979
Durig J.R.,
Analysis of torsional spectra of molecules with two internal C3v rotors. 16. Infrared and Raman spectra, vibrational assignment, methyl torsional potential function, and gas phase thermodynamic functions of 2,3-dimethylbuta-1,3-diene,
J. Phys. Chem., 1979, 83, 2879-2886. [all data]
Durig J.R., 1980
Durig J.R.,
Spectroscopic and thermodynamic study of conformational properties and torsional potential functions of 1-butene,
J. Phys. Chem., 1980, 84, 773-781. [all data]
Durig J.R., 1980, 2
Durig J.R.,
Torsional spectra of molecules with two internal C3v rotors. 19. Vibrational spectra, torsional potential functions, and conformational and thermodynamic properties of 2-methyl-1-butene,
J. Phys. Chem., 1980, 84, 3554-3561. [all data]
Durig J.R., 1981
Durig J.R.,
Analysis of torsional spectra of molecules with two internal C3v rotors. 20. Vibrational spectra, torsional potential functions, and conformational and thermodynamic properties of 3-methyl-1-butene,
J. Phys. Chem., 1981, 85, 426-434. [all data]
Thermodynamics Research Center, 1997
Thermodynamics Research Center,
Selected Values of Properties of Chemical Compounds., Thermodynamics Research Center, Texas A&M University, College Station, Texas, 1997. [all data]
Handrick, 1956
Handrick, G.R.,
Report of the study of pure explosive compounds. Part IV. Calculation of heat of combustion of organic compounds from structural features and calculation of power of high explosives, Rpt. C-58247 for the Office of the Chief of Ordnance, contract DA-19-020-ORD-47 by the Arthur D. Little, Inc., Cambridge, MA, 1956, 467-573. [all data]
Streiff, Soule, et al., 1950
Streiff, A.J.; Soule, L.F.; Kennedy, C.M.; Janes, M.E.; Sedlak, V.A.; Willingham, C.B.; Rossini, F.D.,
Purification, purity, and freezing points of twenty-nine hydrocarbons of the API-standard and API-NBS series.,
J. Res. Natl. Bur. Stand. (U. S.), 1950, 45, 173. [all data]
Dolliver, Gresham, et al., 1937
Dolliver, M.A.; Gresham, T.L.; Kistiakowsky, G.B.; Vaughan, W.E.,
Heats of organic reactions: V heats of hydrogenation of various hydrocarbons,
J. Am. Chem. Soc., 1937, 59, 831. [all data]
Enklaar, 1917
Enklaar, C.J.,
Recl. Trav. Chim. Pays-Bas, 1917, 36, 247. [all data]
Rogers, 1972
Rogers, F.E.,
Thermochemistry of the Diels-Alder reactions. II. Heat of addition of several dienes to tetracyanoethylene,
J. Phys. Chem., 1972, 76, 106-109. [all data]
Stephenson and Malanowski, 1987
Stephenson, Richard M.; Malanowski, Stanislaw,
Handbook of the Thermodynamics of Organic Compounds, 1987, https://doi.org/10.1007/978-94-009-3173-2
. [all data]
Bevan, Malkin, et al., 1955
Bevan, T.H.; Malkin, T.; Smith, D.B.; Davey, W.; Gwilt, J.R.; Cooper, W.; Kertes, S.; Roberts, J.J.; Ross, W.C.J.; Wilson, Walter; Cummings, G.A.McD.; McLaughlin, E.,
Notes,
J. Chem. Soc., 1955, 1383, https://doi.org/10.1039/jr9550001383
. [all data]
Cummings and McLaughlin, 1955
Cummings, G.A.McD.; McLaughlin, E.,
Vapour Pressures of Some Unsaturated Hydrocarbons Containing Six Carbon Atoms,
J. Chem. Soc., 1955, 1391-1392. [all data]
Molnar, Rachford, et al., 1984
Molnar, A.; Rachford, R.; Smith, G.V.; Liu, R.,
Heats of hydrogenation by a simple and rapid flow calorimetric method,
Appl. Catal., 1984, 9, 219-223. [all data]
Dolliver, Gresham, et al., 1937, 2
Dolliver, M.a.; Gresham, T.L.; Kistiakowsky, G.B.; Vaughan, W.E.,
Heats of organic reactions. V. Heats of hydrogenation of various hydrocarbons,
J. Am. Chem. Soc., 1937, 59, 831-841. [all data]
Cox and Pilcher, 1970
Cox, J.D.; Pilcher, G.,
Thermochemistry of Organic and Organometallic Compounds, Academic Press, New York, 1970, 1-636. [all data]
Clifford, Wenthold, et al., 1998
Clifford, E.P.; Wenthold, P.G.; Lineberger, W.C.; Ellison, G.B.; Wang, C.X.; Grabowski, J.J.; Vila, F.; Jordan,
Properties of Tetramethyleneethane (TME) as Revealed by Ion Chemistry and Ion Photoelectron Spectroscopy,
J. Chem. Soc. Perkin Trans., 1998, 2, 5, 1015, https://doi.org/10.1039/a707322d
. [all data]
Hunter and Lias, 1998
Hunter, E.P.; Lias, S.G.,
Evaluated Gas Phase Basicities and Proton Affinities of Molecules: An Update,
J. Phys. Chem. Ref. Data, 1998, 27, 3, 413-656, https://doi.org/10.1063/1.556018
. [all data]
Wolkoff, Holmes, et al., 1980
Wolkoff, P.; Holmes, J.L.; Lossing, F.P.,
On the formation of cyclopentenium cations from all C6H10+ molecular ion structures,
Can. J. Chem., 1980, 58, 251. [all data]
Bieri, Burger, et al., 1977
Bieri, G.; Burger, F.; Heilbronner, E.; Maier, J.P.,
Valence ionization enrgies of hydrocarbons,
Helv. Chim. Acta, 1977, 60, 2213. [all data]
Lossing and Traeger, 1975
Lossing, F.P.; Traeger, J.C.,
Stabilization in cyclopentadienyl, cyclopentenyl, and cyclopentyl cations,
J. Am. Chem. Soc., 1975, 97, 1579. [all data]
Beez, Bieri, et al., 1973
Beez, M.; Bieri, G.; Bock, H.; Heilbronner, E.,
The ionization potentials of butadiene, hexatriene, andtheir methyl derivatives: evidence for through space interaction between double bond π-orbitals and non-bonded pseudo-π orbitals of methyl groups?,
Helv. Chim. Acta, 1973, 56, 1028. [all data]
Bock and Seidl, 1968
Bock, H.; Seidl, H.,
'd-Orbital effects' in silicon- substituted π-electron systems. XI. Syntheses and properties of the isomeric bis(trimethylsilyl)-1,3-butadienes,
J. Am. Chem. Soc., 1968, 90, 5694. [all data]
Price and Walsh, 1940
Price, W.C.; Walsh, A.D.,
The absorption spectra of conjugated dienes in the vacuum ultra-violet (1),
Proc. Roy. Soc. (London), 1940, A174, 220. [all data]
Werstiuk, Clark, et al., 1990
Werstiuk, N.H.; Clark, K.B.; Leigh, W.J.,
Conformational analysis and structure elucidation of 2,3-dimethyl and 2,4-dimethyl-2,4-hexadienes by AM1 and He(I) ultraviolet photoelectron spectroscopy,
Can. J. Chem., 1990, 68, 2078. [all data]
Masclet, Mouvier, et al., 1981
Masclet, P.; Mouvier, G.; Bocquet, J.F.,
Effets electroniques et effets steriques dus a la substitution alcoyle dans les dienes conjugues,
J. Chim. Phys., 1981, 78, 99. [all data]
Worley, Webb, et al., 1979
Worley, S.D.; Webb, T.R.; Gibson, D.H.; Ong, T.-S.,
On the electronic structures of cyclobutadiene trimethylenemethane,
J. Organomet. Chem., 1979, 168, 16. [all data]
Sustmann and Schubert, 1972
Sustmann, R.; Schubert, R.,
Photoelektronenspektroskopische bestimmung von substituenten-effekten. I. Subtituierte butadiene,
Tetrahedron Lett., 1972, 27, 2739. [all data]
Lossing and Traeger, 1975, 2
Lossing, F.P.; Traeger, J.C.,
Free radicals by mass spectrometry XLVI. Heats of formation of C5H7 and C5H9 radicals and cations.,
J. Am. Chem. Soc., 1975, 19, 9. [all data]