2-Butanethiol
- Formula: C4H10S
- Molecular weight: 90.187
- IUPAC Standard InChIKey: LOCHFZBWPCLPAN-UHFFFAOYSA-N
- CAS Registry Number: 513-53-1
- Chemical structure:
View 3d structure (requires JavaScript / HTML 5) - Other names: sec-Butyl thioalcohol; sec-Butanethiol; sec-Butyl mercaptan; sec-Butyl thiol; Secondary butylmercaptan; 1-Methyl-1-propanethiol; 2-Butyl mercaptan; 2-Mercaptobutane; sec-C4H9SH; 2-Butylthiol; NSC 78417; butane-2-thiol

Gas phase thermochemistry data

Data compiled by: Hussein Y. Afeefy, Joel F. Liebman, and Stephen E. Stein
Quantity | Value | Units | Method | Reference | Comment |
---|---|---|---|---|---|
ΔfH°gas | -96.11 ± 0.79 | kJ/mol | Ccr | Hubbard, Good, et al., 1958 |

Condensed phase thermochemistry data

Data compiled as indicated in comments:
ALS - Hussein Y. Afeefy, Joel F. Liebman, and Stephen E. Stein
DH - Eugene S. Domalski and Elizabeth D. Hearing
Quantity | Value | Units | Method | Reference | Comment |
---|---|---|---|---|---|
ΔfH°liquid | -131.0 ± 0.88 | kJ/mol | Ccr | Hubbard, Good, et al., 1958 | Reanalyzed by Cox and Pilcher, 1970, Original value = -130.1 ± 0.75 kJ/mol; ALS |
Quantity | Value | Units | Method | Reference | Comment |
ΔcH°liquid | -3474.6 ± 0.71 | kJ/mol | Ccr | Hubbard, Good, et al., 1958 | Reanalyzed by Cox and Pilcher, 1970, Original value = -3473.9 ± 0.63 kJ/mol; ALS |
Quantity | Value | Units | Method | Reference | Comment |
S°liquid | 271.42 | J/mol*K | N/A | McCullough, Finke, et al., 1958 | DH |
Constant pressure heat capacity of liquid
Cp,liquid (J/mol*K) | Temperature (K) | Reference | Comment |
---|---|---|---|
171.2 | 298.15 | McCullough, Finke, et al., 1958 | T = 12 to 309 K.; DH |

Phase change data

Data compiled as indicated in comments:
BS - Robert L. Brown and Stephen E. Stein
TRC - Thermodynamics Research Center, NIST Boulder Laboratories, Chris Muzny director
AC - William E. Acree, Jr., James S. Chickos
DRB - Donald R. Burgess, Jr.
ALS - Hussein Y. Afeefy, Joel F. Liebman, and Stephen E. Stein
DH - Eugene S. Domalski and Elizabeth D. Hearing
Quantity | Value | Units | Method | Reference | Comment |
---|---|---|---|---|---|
Tboil | 358.0 ± 0.9 | K | AVG | N/A | Average of 6 values; Individual data points |
Quantity | Value | Units | Method | Reference | Comment |
Tfus | 108.2 | K | N/A | Ellis and Reid, 1932 | Uncertainty assigned by TRC = 0.3 K; TRC |
Quantity | Value | Units | Method | Reference | Comment |
Ttriple | 133.02 | K | N/A | McCullough, Finke, et al., 1958, 2 | Uncertainty assigned by TRC = 0.06 K; TRC |
Ttriple | 133.01 | K | N/A | Haines, Helm, et al., 1956 | Uncertainty assigned by TRC = 0.06 K; deterined at Thermdynamics Lab., U. S. Bureau of Mines, Bartlesville, OK; TRC |
Quantity | Value | Units | Method | Reference | Comment |
Tc | 554. | K | N/A | Majer and Svoboda, 1985 | |
Quantity | Value | Units | Method | Reference | Comment |
ΔvapH° | 34.08 | kJ/mol | N/A | Majer and Svoboda, 1985 | |
ΔvapH° | 34.1 | kJ/mol | N/A | Reid, 1972 | AC |
ΔvapH° | 34.9 | kJ/mol | N/A | Hubbard, Good, et al., 1958 | DRB |
ΔvapH° | 34.0 | kJ/mol | V | McCullough, Finke, et al., 1958, 3 | ALS |
Enthalpy of vaporization
ΔvapH (kJ/mol) | Temperature (K) | Method | Reference | Comment |
---|---|---|---|---|
30.59 | 358.1 | N/A | Majer and Svoboda, 1985 | |
33.2 | 325. | A,EB | Stephenson and Malanowski, 1987 | Based on data from 310. to 395. K. See also McCullough, Finke, et al., 1958 and Osborn and Douslin, 1966.; AC |
32.9 ± 0.1 | 318. | C | McCullough, Finke, et al., 1958 | AC |
32.3 ± 0.1 | 329. | C | McCullough, Finke, et al., 1958 | AC |
31.8 ± 0.1 | 337. | C | McCullough, Finke, et al., 1958 | AC |
30.6 ± 0.1 | 358. | C | McCullough, Finke, et al., 1958 | AC |
Enthalpy of vaporization
ΔvapH =
A exp(-βTr) (1 − Tr)β
ΔvapH =
Enthalpy of vaporization (at saturation pressure)
(kJ/mol)
Tr = reduced temperature (T / Tc)
View plot Requires a JavaScript / HTML 5 canvas capable browser.
Temperature (K) | A (kJ/mol) | β | Tc (K) | Reference | Comment |
---|---|---|---|---|---|
318. to 358. | 49.11 | 0.2808 | 554. | Majer and Svoboda, 1985 |
Antoine Equation Parameters
log10(P) = A − (B / (T + C))
P = vapor pressure (bar)
T = temperature (K)
View plot Requires a JavaScript / HTML 5 canvas capable browser.
Temperature (K) | A | B | C | Reference |
---|---|---|---|---|
312.11 to 394.63 | 4.01188 | 1229.904 | -51.129 | Osborn and Douslin, 1966 |
Enthalpy of fusion
ΔfusH (kJ/mol) | Temperature (K) | Reference | Comment |
---|---|---|---|
6.477 | 133.02 | McCullough, Finke, et al., 1958 | DH |
6.48 | 133. | Domalski and Hearing, 1996 | AC |
Entropy of fusion
ΔfusS (J/mol*K) | Temperature (K) | Reference | Comment |
---|---|---|---|
48.69 | 133.02 | McCullough, Finke, et al., 1958 | DH |

Gas phase ion energetics data

Data evaluated as indicated in comments:
HL - Edward P. Hunter and Sharon G. Lias
Data compiled as indicated in comments:
LLK - Sharon G. Lias, Rhoda D. Levin, and Sherif A. Kafafi
Quantity | Value | Units | Method | Reference | Comment |
---|---|---|---|---|---|
Proton affinity (review) | 813. | kJ/mol | N/A | Hunter and Lias, 1998 | HL |
Quantity | Value | Units | Method | Reference | Comment |
Gas basicity | 781.7 | kJ/mol | N/A | Hunter and Lias, 1998 | HL |
Ionization energy determinations
IE (eV) | Method | Reference | Comment |
---|---|---|---|
9.10 | PE | Ogata, Onizuka, et al., 1973 | LLK |

Kovats' RI, non-polar column, isothermal

Column type | Active phase | Temperature (C) | I | Reference | Comment |
---|---|---|---|---|---|
Capillary | DB-5 | 100. | 677.2 | Miller and Bruno, 2003 | 30. m/0.25 mm/0.1 μm |
Capillary | DB-5 | 120. | 688.8 | Miller and Bruno, 2003 | 30. m/0.25 mm/0.1 μm |
Capillary | DB-5 | 60. | 669.4 | Miller and Bruno, 2003 | 30. m/0.25 mm/0.1 μm |
Capillary | DB-5 | 80. | 672.6 | Miller and Bruno, 2003 | 30. m/0.25 mm/0.1 μm |
Packed | Apiezon M | 130. | 679. | Garbuzov, Misharina, et al., 1985 | He or N2, Chromosorb W, AW-DMCS; Column length: 2.1 m |
Packed | Squalane | 60. | 647. | Zygmunt and Staszewski, 1981 | Chromosorb W DMCS; Column length: 2. m |
Packed | Squalane | 80. | 651. | Zygmunt and Staszewski, 1981 | Chromosorb W DMCS; Column length: 2. m |
Packed | Apiezon M | 130. | 681. | Golovnya and Garbuzov, 1974 | N2, Chromosorb W; Column length: 2.1 m |

Kovats' RI, non-polar column, custom temperature program

Column type | Active phase | I | Reference | Comment |
---|---|---|---|---|
Capillary | Apiezon M | 679. | Zhu, Wang, et al., 2007 | Program: not specified |

Kovats' RI, polar column, custom temperature program

Column type | Active phase | I | Reference | Comment |
---|---|---|---|---|
Capillary | PEG-20M | 887. | Zhu, Wang, et al., 2007 | Program: not specified |

Normal alkane RI, non-polar column, isothermal

Column type | Active phase | Temperature (C) | I | Reference | Comment |
---|---|---|---|---|---|
Capillary | Polydimethyl siloxane with 5 % Ph groups | 100. | 677. | Safa and Hadjmohannadi, 2005 | 30. m/0.25 mm/0.10 μm, Nitrogen |
Capillary | Polydimethyl siloxane with 5 % Ph groups | 60. | 669. | Safa and Hadjmohannadi, 2005 | 30. m/0.25 mm/0.10 μm, Nitrogen |
Capillary | Polydimethyl siloxane with 5 % Ph groups | 80. | 673. | Safa and Hadjmohannadi, 2005 | 30. m/0.25 mm/0.10 μm, Nitrogen |

Normal alkane RI, non-polar column, temperature ramp

Column type | Active phase | I | Reference | Comment |
---|---|---|---|---|
Packed | Porapack Q | 650. | Guevas A.P. and Tellez, 1977 | Helium, Porapak Q, 8. K/min; Column length: 3.5 m; Tstart: 220. C |

Normal alkane RI, non-polar column, custom temperature program

Column type | Active phase | I | Reference | Comment |
---|---|---|---|---|
Capillary | Polydimethyl siloxanes | 656. | Zenkevich, 1998 | Program: not specified |
Capillary | OV-1, SE-30, Methyl silicone, SP-2100, OV-101, DB-1, etc. | 681. | Waggott and Davies, 1984 | Hydrogen; Column length: 50. m; Column diameter: 0.32 mm; Program: not specified |

References

Hubbard, Good, et al., 1958
Hubbard, W.N.; Good, W.D.; Waddington, G.,
The heats of combustion, formation and isomerization of the seven isomeric C4H10S alkane thiols and sulfides,
J. Phys. Chem., 1958, 62, 614-617. [all data]
Cox and Pilcher, 1970
Cox, J.D.; Pilcher, G.,
Thermochemistry of Organic and Organometallic Compounds, Academic Press, New York, 1970, 1-636. [all data]
McCullough, Finke, et al., 1958
McCullough, J.P.; Finke, H.L.; Scott, D.W.; Pennington, R.E.; Gross, M.E.; Messerly, J.F.; Waddington, G.,
2-Butanethiol: chemical thermodynamic properties between 0 and 1000K., rotational conformations,
J. Am. Chem. Soc., 1958, 80, 4786-4793. [all data]
Ellis and Reid, 1932
Ellis, L.M.; Reid, E.E.,
The Preparation and Properties of A Double Series of Aliphatic Mercaptans,
J. Am. Chem. Soc., 1932, 54, 1674. [all data]
McCullough, Finke, et al., 1958, 2
McCullough, J.P.; Finke, H.L.; Scott, D.W.; Pennington, R.E.; Gross, M.E.; Messerly, J.F.; Waddington, G.,
2-Butanethiol: chemical thermodynamic properties between 0 and 1000 K; rotational conformations.,
J. Am. Chem. Soc., 1958, 80, 4786-93. [all data]
Haines, Helm, et al., 1956
Haines, W.E.; Helm, R.V.; Cook, G.L.; Ball, J.S.,
Purification and Properties of Organic Sulfur Compounds,
J. Phys. Chem., 1956, 60, 549-55. [all data]
Majer and Svoboda, 1985
Majer, V.; Svoboda, V.,
Enthalpies of Vaporization of Organic Compounds: A Critical Review and Data Compilation, Blackwell Scientific Publications, Oxford, 1985, 300. [all data]
Reid, 1972
Reid, Robert C.,
Handbook on vapor pressure and heats of vaporization of hydrocarbons and related compounds, R. C. Wilhort and B. J. Zwolinski, Texas A Research Foundation. College Station, Texas(1971). 329 pages.$10.00,
AIChE J., 1972, 18, 6, 1278-1278, https://doi.org/10.1002/aic.690180637
. [all data]
McCullough, Finke, et al., 1958, 3
McCullough, J.P.; Finke, H.L.; Scott, D.W.; Pennington, R.E.; Gross, M.E.; Messerly, J.F.; Waddington, G.,
2-butanethiol: Chemical thermodynamic properties between 0 and 1000°K; rotational conformations,
J. Am. Chem. Soc., 1958, 80, 4786-47. [all data]
Stephenson and Malanowski, 1987
Stephenson, Richard M.; Malanowski, Stanislaw,
Handbook of the Thermodynamics of Organic Compounds, 1987, https://doi.org/10.1007/978-94-009-3173-2
. [all data]
Osborn and Douslin, 1966
Osborn, A.G.; Douslin, D.R.,
Vapor Pressure Relations of 36 Sulfur Compounds Present in Petroleum.,
J. Chem. Eng. Data, 1966, 11, 4, 502-509, https://doi.org/10.1021/je60031a014
. [all data]
Domalski and Hearing, 1996
Domalski, Eugene S.; Hearing, Elizabeth D.,
Heat Capacities and Entropies of Organic Compounds in the Condensed Phase. Volume III,
J. Phys. Chem. Ref. Data, 1996, 25, 1, 1, https://doi.org/10.1063/1.555985
. [all data]
Hunter and Lias, 1998
Hunter, E.P.; Lias, S.G.,
Evaluated Gas Phase Basicities and Proton Affinities of Molecules: An Update,
J. Phys. Chem. Ref. Data, 1998, 27, 3, 413-656, https://doi.org/10.1063/1.556018
. [all data]
Ogata, Onizuka, et al., 1973
Ogata, H.; Onizuka, H.; Nihei, Y.; Kamada, H.,
The photoelectron spectra of alcohols, mercaptans and amines,
Bull. Chem. Soc. Jpn., 1973, 46, 3036. [all data]