1-Propanethiol, 2-methyl-
- Formula: C4H10S
- Molecular weight: 90.187
- IUPAC Standard InChIKey: BDFAOUQQXJIZDG-UHFFFAOYSA-N
- CAS Registry Number: 513-44-0
- Chemical structure:
View 3d structure (requires JavaScript / HTML 5) - Other names: Isobutyl mercaptan; 1-Isobutanethiol; 2-Methyl-1-propanethiol; iso-C4H9SH; Isobutanethiol; 2-Methyl-1-propylthiol; 2-Methyl propanethiol; 2-methylpropane-1-thiol

Gas phase thermochemistry data

Data compiled by: Hussein Y. Afeefy, Joel F. Liebman, and Stephen E. Stein
Quantity | Value | Units | Method | Reference | Comment |
---|---|---|---|---|---|
ΔfH°gas | -96.48 ± 0.88 | kJ/mol | Ccr | Hubbard, Good, et al., 1958 |

Condensed phase thermochemistry data

Data compiled as indicated in comments:
ALS - Hussein Y. Afeefy, Joel F. Liebman, and Stephen E. Stein
DH - Eugene S. Domalski and Elizabeth D. Hearing
Quantity | Value | Units | Method | Reference | Comment |
---|---|---|---|---|---|
ΔfH°liquid | -132.0 ± 0.88 | kJ/mol | Ccr | Hubbard, Good, et al., 1958 | Reanalyzed by Cox and Pilcher, 1970, Original value = -131.2 ± 0.88 kJ/mol; ALS |
Quantity | Value | Units | Method | Reference | Comment |
ΔcH°liquid | -3473.5 ± 0.71 | kJ/mol | Ccr | Hubbard, Good, et al., 1958 | Reanalyzed by Cox and Pilcher, 1970, Original value = -3472.8 ± 0.71 kJ/mol; ALS |
Quantity | Value | Units | Method | Reference | Comment |
S°liquid | 266.35 | J/mol*K | N/A | Scott, McCullough, et al., 1958 | DH |
Constant pressure heat capacity of liquid
Cp,liquid (J/mol*K) | Temperature (K) | Reference | Comment |
---|---|---|---|
171.88 | 298.15 | Scott, McCullough, et al., 1958 | T = 10 to 350 K.; DH |

Phase change data

Data compiled as indicated in comments:
BS - Robert L. Brown and Stephen E. Stein
TRC - Thermodynamics Research Center, NIST Boulder Laboratories, Chris Muzny director
AC - William E. Acree, Jr., James S. Chickos
ALS - Hussein Y. Afeefy, Joel F. Liebman, and Stephen E. Stein
DRB - Donald R. Burgess, Jr.
DH - Eugene S. Domalski and Elizabeth D. Hearing
Quantity | Value | Units | Method | Reference | Comment |
---|---|---|---|---|---|
Tboil | 361. ± 1. | K | AVG | N/A | Average of 11 values; Individual data points |
Quantity | Value | Units | Method | Reference | Comment |
Tfus | 128.29 | K | N/A | Morris, Lanum, et al., 1960 | Uncertainty assigned by TRC = 0.02 K; TRC |
Quantity | Value | Units | Method | Reference | Comment |
Ttriple | 128.31 | K | N/A | Scott, McCullough, et al., 1958, 2 | Uncertainty assigned by TRC = 0.05 K; TRC |
Quantity | Value | Units | Method | Reference | Comment |
Tc | 559.5 | K | N/A | Majer and Svoboda, 1985 | |
Quantity | Value | Units | Method | Reference | Comment |
ΔvapH° | 34.71 | kJ/mol | N/A | Majer and Svoboda, 1985 | |
ΔvapH° | 34.6 | kJ/mol | N/A | Reid, 1972 | AC |
ΔvapH° | 34.7 ± 0.08 | kJ/mol | E | Hubbard, Good, et al., 1958 | ALS |
ΔvapH° | 35.5 | kJ/mol | N/A | Hubbard, Good, et al., 1958 | DRB |
ΔvapH° | 34.7 | kJ/mol | V | Scott, McCullough, et al., 1958 | ALS |
Enthalpy of vaporization
ΔvapH (kJ/mol) | Temperature (K) | Method | Reference | Comment |
---|---|---|---|---|
31.01 | 361.6 | N/A | Majer and Svoboda, 1985 | |
33.6 | 329. | A,EB | Stephenson and Malanowski, 1987 | Based on data from 314. to 399. K. See also Scott, McCullough, et al., 1958 and Osborn and Douslin, 1966.; AC |
33.3 ± 0.1 | 321. | C | Scott, McCullough, et al., 1958 | AC |
32.3 ± 0.1 | 340. | C | Scott, McCullough, et al., 1958 | AC |
31.0 ± 0.1 | 361. | C | Scott, McCullough, et al., 1958 | AC |
Enthalpy of vaporization
ΔvapH =
A exp(-βTr) (1 − Tr)β
ΔvapH =
Enthalpy of vaporization (at saturation pressure)
(kJ/mol)
Tr = reduced temperature (T / Tc)
View plot Requires a JavaScript / HTML 5 canvas capable browser.
Temperature (K) | A (kJ/mol) | β | Tc (K) | Reference | Comment |
---|---|---|---|---|---|
321. to 362. | 49.83 | 0.2813 | 559.5 | Majer and Svoboda, 1985 |
Antoine Equation Parameters
log10(P) = A − (B / (T + C))
P = vapor pressure (bar)
T = temperature (K)
View plot Requires a JavaScript / HTML 5 canvas capable browser.
Temperature (K) | A | B | C | Reference |
---|---|---|---|---|
315.4 to 398.36 | 4.01236 | 1237.282 | -52.837 | Osborn and Douslin, 1966 |
Enthalpy of fusion
ΔfusH (kJ/mol) | Temperature (K) | Reference | Comment |
---|---|---|---|
4.9823 | 128.31 | Scott, McCullough, et al., 1958 | DH |
4.98 | 128.3 | Domalski and Hearing, 1996 | AC |
Entropy of fusion
ΔfusS (J/mol*K) | Temperature (K) | Reference | Comment |
---|---|---|---|
388.3 | 128.31 | Scott, McCullough, et al., 1958 | DH |

Reaction thermochemistry data

Data compiled by: John E. Bartmess
Individual Reactions
C4H9S- + =
By formula: C4H9S- + H+ = C4H10S
Quantity | Value | Units | Method | Reference | Comment |
---|---|---|---|---|---|
ΔrH° | 1477. ± 9.2 | kJ/mol | G+TS | Taft, 1987 | gas phase; value altered from reference due to change in acidity scale |
Quantity | Value | Units | Method | Reference | Comment |
ΔrG° | 1451. ± 8.4 | kJ/mol | IMRE | Taft, 1987 | gas phase; value altered from reference due to change in acidity scale |

Gas phase ion energetics data

Data evaluated as indicated in comments:
HL - Edward P. Hunter and Sharon G. Lias
Data compiled as indicated in comments:
B - John E. Bartmess
LLK - Sharon G. Lias, Rhoda D. Levin, and Sherif A. Kafafi
Quantity | Value | Units | Method | Reference | Comment |
---|---|---|---|---|---|
Proton affinity (review) | 802.6 | kJ/mol | N/A | Hunter and Lias, 1998 | HL |
Quantity | Value | Units | Method | Reference | Comment |
Gas basicity | 771.4 | kJ/mol | N/A | Hunter and Lias, 1998 | HL |
Ionization energy determinations
IE (eV) | Method | Reference | Comment |
---|---|---|---|
9.12 | PE | Ogata, Onizuka, et al., 1973 | LLK |
De-protonation reactions
C4H9S- + =
By formula: C4H9S- + H+ = C4H10S
Quantity | Value | Units | Method | Reference | Comment |
---|---|---|---|---|---|
ΔrH° | 1477. ± 9.2 | kJ/mol | G+TS | Taft, 1987 | gas phase; value altered from reference due to change in acidity scale; B |
Quantity | Value | Units | Method | Reference | Comment |
ΔrG° | 1451. ± 8.4 | kJ/mol | IMRE | Taft, 1987 | gas phase; value altered from reference due to change in acidity scale; B |

Kovats' RI, non-polar column, isothermal

Column type | Active phase | Temperature (C) | I | Reference | Comment |
---|---|---|---|---|---|
Capillary | DB-5 | 100. | 687.8 | Miller and Bruno, 2003 | 30. m/0.25 mm/0.1 μm |
Capillary | DB-5 | 120. | 700.0 | Miller and Bruno, 2003 | 30. m/0.25 mm/0.1 μm |
Capillary | DB-5 | 60. | 680.1 | Miller and Bruno, 2003 | 30. m/0.25 mm/0.1 μm |
Capillary | DB-5 | 80. | 683.4 | Miller and Bruno, 2003 | 30. m/0.25 mm/0.1 μm |
Packed | Apiezon M | 130. | 691. | Garbuzov, Misharina, et al., 1985 | He or N2, Chromosorb W, AW-DMCS; Column length: 2.1 m |
Packed | Squalane | 60. | 658. | Zygmunt and Staszewski, 1981 | Chromosorb W DMCS; Column length: 2. m |
Packed | Squalane | 80. | 660. | Zygmunt and Staszewski, 1981 | Chromosorb W DMCS; Column length: 2. m |

Kovats' RI, non-polar column, custom temperature program

Column type | Active phase | I | Reference | Comment |
---|---|---|---|---|
Capillary | Apiezon M | 691. | Zhu, Wang, et al., 2007 | Program: not specified |

Kovats' RI, polar column, custom temperature program

Column type | Active phase | I | Reference | Comment |
---|---|---|---|---|
Capillary | PEG-20M | 910. | Zhu, Wang, et al., 2007 | Program: not specified |

Normal alkane RI, non-polar column, isothermal

Column type | Active phase | Temperature (C) | I | Reference | Comment |
---|---|---|---|---|---|
Capillary | Polydimethyl siloxane with 5 % Ph groups | 100. | 688. | Safa and Hadjmohannadi, 2005 | 30. m/0.25 mm/0.10 μm, Nitrogen |
Capillary | Polydimethyl siloxane with 5 % Ph groups | 60. | 680. | Safa and Hadjmohannadi, 2005 | 30. m/0.25 mm/0.10 μm, Nitrogen |
Capillary | Polydimethyl siloxane with 5 % Ph groups | 80. | 683. | Safa and Hadjmohannadi, 2005 | 30. m/0.25 mm/0.10 μm, Nitrogen |

Normal alkane RI, non-polar column, temperature ramp

Column type | Active phase | I | Reference | Comment |
---|---|---|---|---|
Capillary | PONA | 658. | Yang, Wang, et al., 2004 | 50. m/0.20 mm/0.50 μm, N2, 2. K/min; Tstart: 35. C; Tend: 170. C |
Capillary | PONA | 723. | Yang, Wang, et al., 2004 | 50. m/0.20 mm/0.50 μm, N2, 2. K/min; Tstart: 35. C; Tend: 170. C |
Capillary | PONA | 694. | Yang, Yang, et al., 2003 | 50. m/0.20 mm/0.50 μm, Helium, 2. K/min; Tstart: 30. C; Tend: 170. C |
Packed | Porapack Q | 641. | Guevas A.P. and Tellez, 1977 | Helium, Porapak Q, 8. K/min; Column length: 3.5 m; Tstart: 220. C |

Normal alkane RI, non-polar column, custom temperature program

Column type | Active phase | I | Reference | Comment |
---|---|---|---|---|
Capillary | SE-30 | 660. | Vinogradov, 2004 | Program: not specified |
Capillary | CP Sil 5 CB | 658. | Gijs, Piraprez, et al., 2000 | 50. m/0.32 mm/1.2 μm, He; Program: 33C (16.5min) => 2C/min => 160C => 20C/min => 200C (9min) |
Capillary | Polydimethyl siloxanes | 663. | Zenkevich, 1998 | Program: not specified |
Packed | Apiezon M | 700. | Golovnya, Misharina, et al., 1983 | N2, Chromosorb W AW/DMCS; Column length: 5.6 m; Program: 60C(7min), 100C(7min), 150C isothermal |

Normal alkane RI, polar column, temperature ramp

Column type | Active phase | I | Reference | Comment |
---|---|---|---|---|
Capillary | TC-Wax | 901. | Ishizaki, Tachihara, et al., 2005 | 60. m/0.25 mm/0.25 μm, N2, 3. K/min, 220. C @ 40. min; Tstart: 70. C |

Normal alkane RI, polar column, custom temperature program

Column type | Active phase | I | Reference | Comment |
---|---|---|---|---|
Capillary | TC-Wax | 901. | Kraft and Switt, 2005 | Program: not specified |
Capillary | TC-Wax | 901. | Tachihara, Ishizaki, et al., 2004 | Program: not specified |
Capillary | Carbowax 20M | 889. | Vinogradov, 2004 | Program: not specified |

References

Hubbard, Good, et al., 1958
Hubbard, W.N.; Good, W.D.; Waddington, G.,
The heats of combustion, formation and isomerization of the seven isomeric C4H10S alkane thiols and sulfides,
J. Phys. Chem., 1958, 62, 614-617. [all data]
Cox and Pilcher, 1970
Cox, J.D.; Pilcher, G.,
Thermochemistry of Organic and Organometallic Compounds, Academic Press, New York, 1970, 1-636. [all data]
Scott, McCullough, et al., 1958
Scott, D.W.; McCullough, J.P.; Messerly, J.F.; Pennington, R.E.; Hossenlopp, I.A.; Finke, H.L.; Waddington, G.,
2-Methyl-1-propanethiol: Chemical thermodynamic properties and rotational isomerism,
J. Am. Chem. Soc., 1958, 80, 55-59. [all data]
Morris, Lanum, et al., 1960
Morris, J.C.; Lanum, W.J.; Helm, R.V.; Haines, W.E.; Cook, G.L.; Ball, J.S.,
Purification and Properties of Ten Organic Sulfur Compounds,
J. Chem. Eng. Data, 1960, 5, 112-6. [all data]
Scott, McCullough, et al., 1958, 2
Scott, D.W.; McCullough, J.P.; Messerly, J.F.; Pennington, R.E.; Hossenlopp, I.A.; Finke, H.L.; Waddington, G.,
2-Methyl-1-propanethiol: Chemical Thermodynamic properties and Rotational isomerism.,
J. Am. Chem. Soc., 1958, 80, 55-9. [all data]
Majer and Svoboda, 1985
Majer, V.; Svoboda, V.,
Enthalpies of Vaporization of Organic Compounds: A Critical Review and Data Compilation, Blackwell Scientific Publications, Oxford, 1985, 300. [all data]
Reid, 1972
Reid, Robert C.,
Handbook on vapor pressure and heats of vaporization of hydrocarbons and related compounds, R. C. Wilhort and B. J. Zwolinski, Texas A Research Foundation. College Station, Texas(1971). 329 pages.$10.00,
AIChE J., 1972, 18, 6, 1278-1278, https://doi.org/10.1002/aic.690180637
. [all data]
Stephenson and Malanowski, 1987
Stephenson, Richard M.; Malanowski, Stanislaw,
Handbook of the Thermodynamics of Organic Compounds, 1987, https://doi.org/10.1007/978-94-009-3173-2
. [all data]
Osborn and Douslin, 1966
Osborn, A.G.; Douslin, D.R.,
Vapor Pressure Relations of 36 Sulfur Compounds Present in Petroleum.,
J. Chem. Eng. Data, 1966, 11, 4, 502-509, https://doi.org/10.1021/je60031a014
. [all data]
Domalski and Hearing, 1996
Domalski, Eugene S.; Hearing, Elizabeth D.,
Heat Capacities and Entropies of Organic Compounds in the Condensed Phase. Volume III,
J. Phys. Chem. Ref. Data, 1996, 25, 1, 1, https://doi.org/10.1063/1.555985
. [all data]
Taft, 1987
Taft, R.W.,
The Nature and Analysis of Substitutent Electronic Effects,
Personal communication. See also Prog. Phys. Org. Chem., 1987, 16, 1. [all data]
Hunter and Lias, 1998
Hunter, E.P.; Lias, S.G.,
Evaluated Gas Phase Basicities and Proton Affinities of Molecules: An Update,
J. Phys. Chem. Ref. Data, 1998, 27, 3, 413-656, https://doi.org/10.1063/1.556018
. [all data]
Ogata, Onizuka, et al., 1973
Ogata, H.; Onizuka, H.; Nihei, Y.; Kamada, H.,
The photoelectron spectra of alcohols, mercaptans and amines,
Bull. Chem. Soc. Jpn., 1973, 46, 3036. [all data]
Bol'shakov, et al., 1969
Bol'shakov, G.F., et al.,
Ultraviolet spectra of heteroorganic compounds, 1969, 84. [all data]