2-Propen-1-ol, 2-methyl-
- Formula: C4H8O
- Molecular weight: 72.1057
- IUPAC Standard InChIKey: BYDRTKVGBRTTIT-UHFFFAOYSA-N
- CAS Registry Number: 513-42-8
- Chemical structure:
View 3d structure (requires JavaScript / HTML 5) - Other names: Isopropenyl carbinol; Methallyl alcohol; 2-Methylallyl alcohol; 3-Hydroxy-2-methylpropene; CH2=C(CH3)CH2OH; 2-Methyl-2-propen-1-ol; β-Methallyl alcohol; 2-Methyl-2-propene-1-ol; UN 2614; 2-Methylprop-2-en-1-ol; 2-Methallyl alcohol; 2-Methyl-2-propenol; Methacryl alcohol; NSC 30674; β-Methylallyl alcohol

Phase change data

Data compiled as indicated in comments:
BS - Robert L. Brown and Stephen E. Stein
AC - William E. Acree, Jr., James S. Chickos
Quantity | Value | Units | Method | Reference | Comment |
---|---|---|---|---|---|
Tboil | 387.7 | K | N/A | Weast and Grasselli, 1989 | BS |
Quantity | Value | Units | Method | Reference | Comment |
ΔvapH° | 51.9 | kJ/mol | CGC | Chickos, Hosseini, et al., 1995 | Based on data from 323. to 373. K.; AC |

Gas phase ion energetics data

Data compiled as indicated in comments:
LBLHLM - Sharon G. Lias, John E. Bartmess, Joel F. Liebman, John L. Holmes, Rhoda D. Levin, and W. Gary Mallard
Ionization energy determinations
IE (eV) | Method | Reference | Comment |
---|---|---|---|
9.24 | PI | Traeger and McAdoo, 1986 | LBLHLM |
9.28 ± 0.05 | EI | Holmes and Lossing, 1983 | LBLHLM |
Appearance energy determinations
Ion | AE (eV) | Other Products | Method | Reference | Comment |
---|---|---|---|---|---|
C2H3O+ | 9.69 | C2H5 | PI | Traeger and McAdoo, 1986 | LBLHLM |

Reaction thermochemistry data

Data compiled by: Hussein Y. Afeefy, Joel F. Liebman, and Stephen E. Stein
Individual Reactions
By formula: C4H8O = C4H8O
Quantity | Value | Units | Method | Reference | Comment |
---|---|---|---|---|---|
ΔrH° | -17.03 | kJ/mol | Kin | Farberov, Bondarenko, et al., 1984 | liquid phase |

References

Weast and Grasselli, 1989
CRC Handbook of Data on Organic Compounds, 2nd Editon, Weast,R.C and Grasselli, J.G., ed(s)., CRC Press, Inc., Boca Raton, FL, 1989, 1. [all data]
Chickos, Hosseini, et al., 1995
Chickos, James S.; Hosseini, Sarah; Hesse, Donald G.,
Determination of vaporization enthalpies of simple organic molecules by correlations of changes in gas chromatographic net retention times,
Thermochimica Acta, 1995, 249, 41-62, https://doi.org/10.1016/0040-6031(95)90670-3
. [all data]
Traeger and McAdoo, 1986
Traeger, J.C.; McAdoo, D.J.,
Decomposition thresholds and associated translational energy releases for eight C4H8O+ isomers,
Int. J. Mass Spectrom. Ion Processes, 1986, 68, 35. [all data]
Holmes and Lossing, 1983
Holmes, J.L.; Lossing, F.P.,
The need for adequate thermochemical data for the interpretation of fragmentation mechanisms and ion structure assignments,
Int. J. Mass Spectrom. Ion Phys., 1983, 47, 133. [all data]