Propane, 1-iodo-2-methyl-
- Formula: C4H9I
- Molecular weight: 184.0187
- IUPAC Standard InChIKey: BTUGGGLMQBJCBN-UHFFFAOYSA-N
- CAS Registry Number: 513-38-2
- Chemical structure:

Gas phase ion energetics data

Data evaluated as indicated in comments:
L - Sharon G. Lias
Data compiled as indicated in comments:
LL - Sharon G. Lias and Joel F. Liebman
LLK - Sharon G. Lias, Rhoda D. Levin, and Sherif A. Kafafi
RDSH - Henry M. Rosenstock, Keith Draxl, Bruce W. Steiner, and John T. Herron
Quantity | Value | Units | Method | Reference | Comment |
---|---|---|---|---|---|
IE (evaluated) | 9.18 ± 0.01 | eV | N/A | N/A | L |
Ionization energy determinations
IE (eV) | Method | Reference | Comment |
---|---|---|---|
9.23 | EST | Luo and Pacey, 1992 | LL |
9.18 | PE | Kimura, Katsumata, et al., 1981 | LLK |
9.20 | PE | Boschi and Salahub, 1974 | LLK |
9.04 | PE | Boschi and Salahub, 1974 | LLK |
9.202 | S | Boschi and Salahub, 1972 | LLK |
9.20 | PE | Boschi and Salahub, 1972 | LLK |
9.18 ± 0.005 | PE | Cocksey, Eland, et al., 1971 | LLK |
9.08 | PE | Brogli and Heilbronner, 1971 | LLK |
9.18 ± 0.02 | PI | Watanabe, Nakayama, et al., 1962 | RDSH |
9.4 | PE | Dromey and Peel, 1974 | Vertical value; LLK |
Appearance energy determinations
Ion | AE (eV) | Other Products | Method | Reference | Comment |
---|---|---|---|---|---|
C4H9+ | 9.180 ± 0.015 | I | PIPECO | Keister, Riley, et al., 1993 | T = 0K; LL |

Kovats' RI, non-polar column, isothermal

Column type | Active phase | Temperature (C) | I | Reference | Comment |
---|---|---|---|---|---|
Packed | Squalane | 27. | 759. | Hively and Hinton, 1968 | He, Chromosorb P; Column length: 15. m; Column diameter: 0.25 mm |
Packed | Squalane | 49. | 767. | Hively and Hinton, 1968 | He, Chromosorb P; Column length: 15. m; Column diameter: 0.25 mm |
Packed | Squalane | 67. | 773. | Hively and Hinton, 1968 | He, Chromosorb P; Column length: 15. m; Column diameter: 0.25 mm |
Packed | Squalane | 86. | 779. | Hively and Hinton, 1968 | He, Chromosorb P; Column length: 15. m; Column diameter: 0.25 mm |

Phase change data

Data compiled as indicated in comments:
BS - Robert L. Brown and Stephen E. Stein
TRC - Thermodynamics Research Center, NIST Boulder Laboratories, Chris Muzny director
AC - William E. Acree, Jr., James S. Chickos
ALS - Hussein Y. Afeefy, Joel F. Liebman, and Stephen E. Stein
Quantity | Value | Units | Method | Reference | Comment |
---|---|---|---|---|---|
Tboil | 393.2 | K | N/A | Weast and Grasselli, 1989 | BS |
Tboil | 394.2 | K | N/A | Majer and Svoboda, 1985 | |
Tboil | 393. | K | N/A | Ogata and Aoki, 1969 | Uncertainty assigned by TRC = 2. K; TRC |
Tboil | 393.6 | K | N/A | Lecat, 1927 | Uncertainty assigned by TRC = 0.5 K; TRC |
Tboil | 393.6 | K | N/A | Lecat, 1927, 2 | Uncertainty assigned by TRC = 0.5 K; TRC |
Quantity | Value | Units | Method | Reference | Comment |
Tfus | 169.15 | K | N/A | Timmermans, 1921 | Uncertainty assigned by TRC = 0.4 K; TRC |
Tfus | 169. | K | N/A | Timmermans, 1921 | Uncertainty assigned by TRC = 0.4 K; TRC |
Quantity | Value | Units | Method | Reference | Comment |
ΔvapH° | 9.288 | kcal/mol | N/A | Majer and Svoboda, 1985 | |
ΔvapH° | 9.27 ± 0.02 | kcal/mol | C | Wadsö, Luoma, et al., 1968 | AC |
ΔvapH° | 9.281 ± 0.005 | kcal/mol | C | Wadso, 1968 | ALS |
Enthalpy of vaporization
ΔvapH (kcal/mol) | Temperature (K) | Method | Reference | Comment |
---|---|---|---|---|
8.016 | 394.2 | N/A | Majer and Svoboda, 1985 | |
9.82 | 271. | A | Stephenson and Malanowski, 1987 | Based on data from 256. to 393. K. See also Stull, 1947.; AC |
Antoine Equation Parameters
log10(P) = A − (B / (T + C))
P = vapor pressure (atm)
T = temperature (K)
View plot Requires a JavaScript / HTML 5 canvas capable browser.
Temperature (K) | A | B | C | Reference | Comment |
---|---|---|---|---|---|
256. to 393.6 | 4.71752 | 1711.247 | -30.92 | Stull, 1947 | Coefficents calculated by NIST from author's data. |

References

Luo and Pacey, 1992
Luo, Y.-R.; Pacey, P.D.,
Effects of alkyl substitution on ionization energies of alkanes and haloalkanes and on heats of formation of their molecular cations. Part 2. Alkanes and chloro-, bromo- and iodoalkanes,
Int. J. Mass Spectrom. Ion Processes, 1992, 112, 63. [all data]
Kimura, Katsumata, et al., 1981
Kimura, K.; Katsumata, S.; Achiba, Y.; Yamazaki, T.; Iwata, S.,
Ionization energies, Ab initio assignments, and valence electronic structure for 200 molecules
in Handbook of HeI Photoelectron Spectra of Fundamental Organic Compounds, Japan Scientific Soc. Press, Tokyo, 1981. [all data]
Boschi and Salahub, 1974
Boschi, R.A.A.; Salahub, D.R.,
The high resolution photoelectron spectra of some iodoalkanes, iodocycloalkanes, iodoalkenes, and fluoroiodohydrocarbons,
Can. J. Chem., 1974, 52, 1217. [all data]
Boschi and Salahub, 1972
Boschi, R.A.; Salahub, D.R.,
The far ultra-violet spectra of some branched chain iodo-alkanes, iodo-cycloalkanes, fluoro-iodoalkanes and iodo-alkenes,
Mol. Phys., 1972, 24, 735. [all data]
Cocksey, Eland, et al., 1971
Cocksey, B.J.; Eland, J.H.D.; Danby, C.J.,
The effect of alkyl substitution on ionisation potential,
J. Chem. Soc., 1971, (B), 790. [all data]
Brogli and Heilbronner, 1971
Brogli, F.; Heilbronner, E.,
The competition between spin orbit coupling and conjugation in alkyl halides and its repercussion on their photoelectron spectra,
Helv. Chim. Acta, 1971, 54, 1423. [all data]
Watanabe, Nakayama, et al., 1962
Watanabe, K.; Nakayama, T.; Mottl, J.,
Ionization potentials of some molecules,
J. Quant. Spectry. Radiative Transfer, 1962, 2, 369. [all data]
Dromey and Peel, 1974
Dromey, R.G.; Peel, J.B.,
Photoelectron spectroscopic correlation of the molecular orbitals of the alkanes and alkyl iodides,
J. Mol. Struct., 1974, 23, 53. [all data]
Keister, Riley, et al., 1993
Keister, J.W.; Riley, J.S.; Baer, T.,
The tert-butyl ion heat of formation and the isobutene proton affinity,
J. Am. Chem. Soc., 1993, 115, 12613. [all data]
Hively and Hinton, 1968
Hively, R.A.; Hinton, R.E.,
Variation of the retention index with temperature on squalane substrates,
J. Gas Chromatogr., 1968, 6, 4, 203-217, https://doi.org/10.1093/chromsci/6.4.203
. [all data]