TiCO

Vibrational and/or electronic energy levels

Data compiled by: Marilyn E. Jacox

State:   X

Vib.
sym.
 No.   Approximate
 type of mode
 cm-1   Med.   Method   References

1 CO stretch 1920.0 Ne IR Zhou and Andrews, 1999
1 CO stretch 1887.8 Ar IR Chertihin and Andrews, 1995
Zhou and Andrews, 1999

Additional references: Jacox, 1998, page 166; Jacox, 2003, page 65

References

Zhou and Andrews, 1999
Zhou, M.; Andrews, L., Infrared Spectra and Density Functional Calculations of Small Vanadium and Titanium Carbonyl Molecules and Anions in Solid Neon, J. Phys. Chem. A, 1999, 103, 27, 5259, https://doi.org/10.1021/jp990549o . [all data]

Chertihin and Andrews, 1995
Chertihin, G.V.; Andrews, L., Infrared Spectra of the Reaction Products of Laser-Ablated Titanium Atoms and Oxides with Carbon Monoxide in Solid Argon, J. Am. Chem. Soc., 1995, 117, 5, 1595, https://doi.org/10.1021/ja00110a014 . [all data]

Jacox, 1998
Jacox, M.E., Vibrational and electronic energy levels of polyatomic transient molecules: supplement A, J. Phys. Chem. Ref. Data, 1998, 27, 2, 115-393, https://doi.org/10.1063/1.556017 . [all data]

Jacox, 2003
Jacox, M.E., Vibrational and electronic energy levels of polyatomic transient molecules: supplement B, J. Phys. Chem. Ref. Data, 2003, 32, 1, 1-441, https://doi.org/10.1063/1.1497629 . [all data]