Molybdenum,chlorobis(η5-2,4-cyclopentadien-1-yl)(trimethylstannyl)-
- Formula: C13H19ClMoSn
- Molecular weight: 425.41
- CAS Registry Number: 51231-83-5

Gas phase ion energetics data

Data compiled by: Sharon G. Lias, Rhoda D. Levin, and Sherif A. Kafafi
Ionization energy determinations
IE (eV) | Method | Reference |
---|---|---|
6.55 ± 0.12 | EI | Harris and Spalding, 1980 |
Appearance energy determinations
Ion | AE (eV) | Other Products | Method | Reference | Comment |
---|---|---|---|---|---|
C3H9Sn+ | 9.30 ± 0.14 | ? | EI | Harris and Spalding, 1980 |

References

Harris and Spalding, 1980
Harris, D.H.; Spalding, T.R.,
Electron impact study of compounds with main group IV element to transition metal bonds,
Inorg. Chim. Acta, 1980, 39, 187. [all data]