Germane,trimethyl(1-naphthalenylmethyl)-
- Formula: C14H18Ge
- Molecular weight: 258.93
- IUPAC Standard InChIKey: IXMAKJMLHJWYNI-UHFFFAOYSA-N
- CAS Registry Number: 51220-35-0
- Chemical structure:
View 3d structure (requires JavaScript / HTML 5) - Permanent link for this species. Use this link for bookmarking this species for future reference.

Gas phase ion energetics data

Data compiled by: Sharon G. Lias, Rhoda D. Levin, and Sherif A. Kafafi
Ionization energy determinations
IE (eV) | Method | Reference |
---|---|---|
7.78 | CTS | Pitt, 1973 |

References

Pitt, 1973
Pitt, C.G.,
Hyperconjugation and its role in group IV chemistry,
J. Organomet. Chem., 1973, 61, 49. [all data]