Argon, compound with krypton (1:1)
- Formula: ArKr
- Molecular weight: 123.746
- IUPAC Standard InChIKey: WZSUOQDIYKMPMT-UHFFFAOYSA-N
- CAS Registry Number: 51184-77-1
- Chemical structure:
View 3d structure (requires JavaScript / HTML 5) - Permanent link for this species. Use this link for bookmarking this species for future reference.

Gas phase ion energetics data

Data compiled as indicated in comments:
LBLHLM - Sharon G. Lias, John E. Bartmess, Joel F. Liebman, John L. Holmes, Rhoda D. Levin, and W. Gary Mallard
LLK - Sharon G. Lias, Rhoda D. Levin, and Sherif A. Kafafi
Ionization energy determinations
IE (eV) | Method | Reference | Comment |
---|---|---|---|
13.484 ± 0.015 | PI | Dehmer and Pratt, 1982 | T = 0K; LBLHLM |
14.0 ± 0.2 | EI | Helm, Stephan, et al., 1979 | LLK |
13.43 ± 0.02 | PI | Ng, Tiedemann, et al., 1977 | LLK |

References

Dehmer and Pratt, 1982
Dehmer, P.M.; Pratt, S.T.,
Photoionization of ArKr, ArXe, and KrXe and bond dissociation energies of the rare gas dimer ions,
J. Chem. Phys., 1982, 77, 4804. [all data]
Helm, Stephan, et al., 1979
Helm, H.; Stephan, K.; Mark, T.D.,
Electron-impact ionization of Ar2, ArKr, Kr2, KrXe, and Xe2,
Phys. Rev. A:, 1979, 19, 2154. [all data]
Ng, Tiedemann, et al., 1977
Ng, C.Y.; Tiedemann, P.W.; Mahan, B.H.; Lee, Y.T.,
Photoionization studies of the diatomic heteronuclear rare gas molecules XeKr, XeAr, and KrAr,
J. Chem. Phys., 1977, 66, 5737. [all data]