1H-Benzimidazole
- Formula: C7H6N2
- Molecular weight: 118.1359
- IUPAC Standard InChIKey: HYZJCKYKOHLVJF-UHFFFAOYSA-N
- CAS Registry Number: 51-17-2
- Chemical structure:
View 3d structure (requires JavaScript / HTML 5) - Other names: Benzimidazole; o-Benzimidazole; Azindole; Benziminazole; Benzoglyoxaline; Benzoimidazole; BZI; N,N'-Methenyl-o-phenylenediamine; 1,3-Benzodiazole; 1,3-Diazaindene; 3-Azaindole; NSC 759

Condensed phase thermochemistry data

Data compiled as indicated in comments:
ALS - Hussein Y. Afeefy, Joel F. Liebman, and Stephen E. Stein
DH - Eugene S. Domalski and Elizabeth D. Hearing
Quantity | Value | Units | Method | Reference | Comment |
---|---|---|---|---|---|
ΔfH°solid | 79.5 ± 1.3 | kJ/mol | Ccb | Jimenez, Roux, et al., 1987 | see Jimenez, Roux, et al., 1986; ALS |
Quantity | Value | Units | Method | Reference | Comment |
ΔcH°solid | -3691.6 ± 1.0 | kJ/mol | Ccb | Jimenez, Roux, et al., 1987 | see Jimenez, Roux, et al., 1986; ALS |
ΔcH°solid | -3697. | kJ/mol | Ccb | Zimmerman and Geisenfelder, 1961 | ALS |
Constant pressure heat capacity of solid
Cp,solid (J/mol*K) | Temperature (K) | Reference | Comment |
---|---|---|---|
128.8 | 298.15 | Jimenez, Roux, et al., 1987 | Cp given as 1.09 J K-1 g-1.; DH |

Phase change data

Data compiled as indicated in comments:
AC - William E. Acree, Jr., James S. Chickos
ALS - Hussein Y. Afeefy, Joel F. Liebman, and Stephen E. Stein
DRB - Donald R. Burgess, Jr.
Quantity | Value | Units | Method | Reference | Comment |
---|---|---|---|---|---|
ΔsubH° | 101. ± 7. | kJ/mol | AVG | N/A | Average of 6 values; Individual data points |
Enthalpy of sublimation
ΔsubH (kJ/mol) | Temperature (K) | Method | Reference | Comment |
---|---|---|---|---|
90.2 ± 0.6 | 363. | C | Lehman, Gentry, et al., 1998 | AC |
101.8 ± 0.4 | 350. | ME | Jimenez, Roux, et al., 1987 | Based on data from 340. to 359. K.; AC |
Enthalpy of fusion
ΔfusH (kJ/mol) | Temperature (K) | Reference | Comment |
---|---|---|---|
20.47 | 445.5 | Domanska, Kozlowska, et al., 2002 | AC |
19.25 | 443.2 | Pitzer, Peiper, et al., 1984 | AC |

Gas phase ion energetics data

Data evaluated as indicated in comments:
HL - Edward P. Hunter and Sharon G. Lias
Data compiled as indicated in comments:
LLK - Sharon G. Lias, Rhoda D. Levin, and Sherif A. Kafafi
Quantity | Value | Units | Method | Reference | Comment |
---|---|---|---|---|---|
Proton affinity (review) | 953.8 | kJ/mol | N/A | Hunter and Lias, 1998 | HL |
Quantity | Value | Units | Method | Reference | Comment |
Gas basicity | 920.5 | kJ/mol | N/A | Hunter and Lias, 1998 | HL |
Ionization energy determinations
IE (eV) | Method | Reference | Comment |
---|---|---|---|
8.0 | PE | Kovac, Klasinc, et al., 1980 | LLK |
8.0 | PE | Ramsey, 1979 | LLK |
8.45 | PE | Kovac, Klasinc, et al., 1980 | Vertical value; LLK |
8.44 | PE | Ramsey, 1979 | Vertical value; LLK |

Normal alkane RI, polar column, temperature ramp

Column type | Active phase | I | Reference | Comment |
---|---|---|---|---|
Capillary | FFAP | 2039. | Nebesny, Budryn, et al., 2007 | 30. m/0.32 mm/0.5 μm, N2, 35. C @ 5. min, 4. K/min, 320. C @ 45. min |

Gas phase thermochemistry data

Data compiled by: Hussein Y. Afeefy, Joel F. Liebman, and Stephen E. Stein
Quantity | Value | Units | Method | Reference | Comment |
---|---|---|---|---|---|
ΔfH°gas | 181.7 ± 1.4 | kJ/mol | Ccb | Jimenez, Roux, et al., 1987 | see Jimenez, Roux, et al., 1986 |

References

Jimenez, Roux, et al., 1987
Jimenez, P.; Roux, M.V.; Turrion, C.,
Thermochemical properties of N-heterocyclic compounds. I. Enthalpies of combustion, vapour pressures and enthalpies of sublimation, and enthalpies of formation of pyrazole, imidazole, indazole, and benzimidazole,
J. Chem. Thermodyn., 1987, 19, 985-992. [all data]
Jimenez, Roux, et al., 1986
Jimenez, P.; Roux, M.V.; Turrion, C.; Gomis, F.,
Thermochemical properties of some N-heterocyclic compounds,
J. Calorim. Anal. Therm. Thermodyn. Chim., 1986, 17, 469-470. [all data]
Zimmerman and Geisenfelder, 1961
Zimmerman, H.; Geisenfelder, H.,
Uber die Mesomerieenergie von Azolen,
Z. Electrochem., 1961, 65, 368-371. [all data]
Lehman, Gentry, et al., 1998
Lehman, Richard L.; Gentry, Jefffery S.; Glumac, Nick G.,
Thermal stability of potassium carbonate near its melting point,
Thermochimica Acta, 1998, 316, 1, 1-9, https://doi.org/10.1016/S0040-6031(98)00289-5
. [all data]
Domanska, Kozlowska, et al., 2002
Domanska, Urszula; Kozlowska, Marta Karolina; Rogalski, Marek,
Solubilities, Partition Coefficients, Density, and Surface Tension for Imidazoles + Octan-1-ol or + Water or + n -Decane «8224»,
J. Chem. Eng. Data, 2002, 47, 3, 456-466, https://doi.org/10.1021/je0103014
. [all data]
Pitzer, Peiper, et al., 1984
Pitzer, Kenneth S.; Peiper, J. Christopher; Busey, R.H.,
Thermodynamic Properties of Aqueous Sodium Chloride Solutions,
J. Phys. Chem. Ref. Data, 1984, 13, 1, 1, https://doi.org/10.1063/1.555709
. [all data]
Hunter and Lias, 1998
Hunter, E.P.; Lias, S.G.,
Evaluated Gas Phase Basicities and Proton Affinities of Molecules: An Update,
J. Phys. Chem. Ref. Data, 1998, 27, 3, 413-656, https://doi.org/10.1063/1.556018
. [all data]
Kovac, Klasinc, et al., 1980
Kovac, B.; Klasinc, L.; Stanovnik, B.; Tisler, M.,
Photoelectron spectroscopy of J. Heterocycl. Chem.. Azaindenes azaindolizines (1),
J. Heterocycl. Chem., 1980, 17, 689. [all data]
Ramsey, 1979
Ramsey, B.G.,
Substituent effects on imidazole basicity and photoelectron spectroscopy determined ionization energies,
J. Org. Chem., 1979, 44, 2093. [all data]
Steck, Nachod, et al., 1948
Steck, E.A.; Nachod, F.C.; Ewing, G.W.; Gorman, N.H.,
Absorption spectra of heterocyclic compounds. III. Some benzimidazole derivatives,
J. Am. Chem. Soc., 1948, 70, 3406-3410. [all data]
Nebesny, Budryn, et al., 2007
Nebesny, E.; Budryn, G.; Kula, J.; Majda, T.,
The effect of roasting method on headspace composition of robusta coffee bean aroma,
Eur. Food Res. Technol., 2007, 225, 1, 9-19, https://doi.org/10.1007/s00217-006-0375-0
. [all data]