Tellurium, bis(1-methylethyl)-
- Formula: C6H14Te
- Molecular weight: 213.78
- IUPAC Standard InChIKey: NYOZTOCADHXMEV-UHFFFAOYSA-N
- CAS Registry Number: 51112-72-2
- Chemical structure:
View 3d structure (requires JavaScript / HTML 5) - Permanent link for this species. Use this link for bookmarking this species for future reference.

Phase change data

Data compiled by: William E. Acree, Jr., James S. Chickos
Enthalpy of vaporization
ΔvapH (kcal/mol) | Temperature (K) | Reference | Comment |
---|---|---|---|
9.66 ± 0.02 | 349. | Baev, Podkovirov, et al., 1996 | Based on data from 298. to 399. K. |

Gas phase ion energetics data

Data compiled by: Sharon G. Lias and Joel F. Liebman
Ionization energy determinations
IE (eV) | Method | Reference | Comment |
---|---|---|---|
7.56 | PE | Sinegovskaya, Tatarinova, et al., 1991 | Vertical value |

References

Baev, Podkovirov, et al., 1996
Baev, A.K.; Podkovirov, A.I.; Kosirkin, V.I.,
Thermodynamic properties and associative interactions of alkyl compounds of tellurium,
Izv. Vyssh. Uchebn. Zaved., Khim. Khim. Tekhnol., 1996, 39, 6, 10. [all data]
Sinegovskaya, Tatarinova, et al., 1991
Sinegovskaya, L.M.; Tatarinova, A.A.; Gusarova, N.K.; Trofimov, B.A.,
Photoelectron spectra of vinyl tellurides,
Izv. Akad. Nauk SSSR, Ser. Khim., 1991, 4, 935. [all data]