Thiourea,(2-nitrophenyl)-
- Formula: C7H7N3O2S
- Molecular weight: 197.214
- IUPAC Standard InChIKey: FLGZBEKWHFRZNP-UHFFFAOYSA-N
- CAS Registry Number: 51039-84-0
- Chemical structure:
View 3d structure (requires JavaScript / HTML 5) - Permanent link for this species. Use this link for bookmarking this species for future reference.

Gas phase ion energetics data

Data compiled by: Sharon G. Lias, Rhoda D. Levin, and Sherif A. Kafafi
Ionization energy determinations
IE (eV) | Method | Reference |
---|---|---|
8.30 | EI | Baldwin, Loudon, et al., 1976 |
Appearance energy determinations
Ion | AE (eV) | Other Products | Method | Reference | Comment |
---|---|---|---|---|---|
C7H7N2S+ | 8.60 | NO2 | EI | Baldwin, Loudon, et al., 1976 |

References

Baldwin, Loudon, et al., 1976
Baldwin, M.A.; Loudon, A.G.; Maccoll, A.; Webb, K.S.,
The nature and fragmentation pathways of the molecular ions of some arylureas, arylthioureas, acetanilides, thioacetanilides and related compounds,
Org. Mass Spectrom., 1976, 11, 1181. [all data]