Propanedioic acid, diethyl-
- Formula: C7H12O4
- Molecular weight: 160.1678
- IUPAC Standard InChIKey: LTMRRSWNXVJMBA-UHFFFAOYSA-N
- CAS Registry Number: 510-20-3
- Chemical structure:
View 3d structure (requires JavaScript / HTML 5) - Other names: Malonic acid, diethyl-; Diethylmalonic acid; 3,3-Pentanedicarboxylic acid

Gas phase ion energetics data

Data compiled by: Sharon G. Lias, Rhoda D. Levin, and Sherif A. Kafafi
Ionization energy determinations
IE (eV) | Method | Reference | Comment |
---|---|---|---|
10.40 | PE | Ajo, Ciliberto, et al., 1980 | Vertical value |

References

Ajo, Ciliberto, et al., 1980
Ajo, D.; Ciliberto, E.; Fragala, I.; Granozzi, G.,
Lone-pair interactions in the photoelectron spectra of dicarboxylic acids: Malonic acid its α-alkyl derivatives,
J. Mol. Struct., 1980, 62, 189. [all data]