4-Pyridylmethyl radical
- Formula: C6H6N
- Molecular weight: 92.1185
- IUPAC Standard InChIKey: DGYIJVNZSDYBOE-UHFFFAOYSA-N
- CAS Registry Number: 51010-00-5
- Chemical structure:
View 3d structure (requires JavaScript / HTML 5) - Permanent link for this species. Use this link for bookmarking this species for future reference.

Gas phase ion energetics data

Data compiled by: Henry M. Rosenstock, Keith Draxl, Bruce W. Steiner, and John T. Herron
Ionization energy determinations
IE (eV) | Method | Reference |
---|---|---|
8.40 ± 0.15 | EI | Palmer and Lossing, 1963 |

References

Palmer and Lossing, 1963
Palmer, T.F.; Lossing, F.P.,
Free radicals by mass spectrometry. XXX. Ionization potentials of anilino and 2-, 3-, and 4-pyridylmethyl radicals,
J. Am. Chem. Soc., 1963, 85, 1733. [all data]