4-(2-Phenylvinyl)pyridine, trans-
- Formula: C13H11N
- Molecular weight: 181.2331
- IUPAC Standard InChIKey: QKHRGPYNTXRMSL-VOTSOKGWSA-N
- CAS Registry Number: 5097-93-8
- Chemical structure:
View 3d structure (requires JavaScript / HTML 5) - Other names: 4-(2-Phenylethenyl)pyridine, (E); Pyridine, 4-(2-phenylethenyl)-, (E)-; Pyridine, trans-4-(2-phenylethenyl)-

Gas phase ion energetics data

Data compiled as indicated in comments:
LLK - Sharon G. Lias, Rhoda D. Levin, and Sherif A. Kafafi
Ionization energy determinations
IE (eV) | Method | Reference | Comment |
---|---|---|---|
8.36 | EI | Schubert, Ramana, et al., 1980 | LLK |
8.34 ± 0.05 | PE | Distefano, Mazzucato, et al., 1975 | Vertical value; LLK |
Appearance energy determinations
Ion | AE (eV) | Other Products | Method | Reference | Comment |
---|---|---|---|---|---|
C13H10N+ | 10.3 | H | EI | Schubert, Ramana, et al., 1980 | LLK |

References

Schubert, Ramana, et al., 1980
Schubert, R.; Ramana, D.V.; Grutzmacher, H.-F.,
Freisetzung kinetischer energie und hammond-postulat bei der intramolekularen aromatischen substitution in 2-stilbazol-ionen,
Chem. Ber., 1980, 113, 3758. [all data]
Distefano, Mazzucato, et al., 1975
Distefano, G.; Mazzucato, U.; Modelli, A.; Pignataro, S.; Orlandi, G.,
Photoelectron (He I) spectroscopic study of styrylpyridines,
J. Chem. Soc. Faraday Trans. 2, 1975, 71, 1583. [all data]