3-(2-Phenylethenyl)pyridine, (E)
- Formula: C13H11N
- Molecular weight: 181.2331
- IUPAC Standard InChIKey: RMSGACVDMOLUPL-CMDGGOBGSA-N
- CAS Registry Number: 5097-91-6
- Chemical structure:
View 3d structure (requires JavaScript / HTML 5) - Permanent link for this species. Use this link for bookmarking this species for future reference.

Gas phase ion energetics data

Data compiled as indicated in comments:
LLK - Sharon G. Lias, Rhoda D. Levin, and Sherif A. Kafafi
Ionization energy determinations
IE (eV) | Method | Reference | Comment |
---|---|---|---|
8.35 | EI | Schubert, Ramana, et al., 1980 | LLK |
8.10 ± 0.05 | PE | Distefano, Mazzucato, et al., 1975 | Vertical value; LLK |
Appearance energy determinations
Ion | AE (eV) | Other Products | Method | Reference | Comment |
---|---|---|---|---|---|
C13H10N+ | 10.2 | H | EI | Schubert, Ramana, et al., 1980 | LLK |

References

Schubert, Ramana, et al., 1980
Schubert, R.; Ramana, D.V.; Grutzmacher, H.-F.,
Freisetzung kinetischer energie und hammond-postulat bei der intramolekularen aromatischen substitution in 2-stilbazol-ionen,
Chem. Ber., 1980, 113, 3758. [all data]
Distefano, Mazzucato, et al., 1975
Distefano, G.; Mazzucato, U.; Modelli, A.; Pignataro, S.; Orlandi, G.,
Photoelectron (He I) spectroscopic study of styrylpyridines,
J. Chem. Soc. Faraday Trans. 2, 1975, 71, 1583. [all data]