3-Hexene, 3-ethyl-4-methyl-
- Formula: C9H18
- Molecular weight: 126.2392
- IUPAC Standard InChIKey: VMUFADLSUAAIEH-UHFFFAOYSA-N
- CAS Registry Number: 50787-13-8
- Chemical structure:
View 3d structure (requires JavaScript / HTML 5) - Permanent link for this species. Use this link for bookmarking this species for future reference.

Phase change data

Data compiled by: Thermodynamics Research Center, NIST Boulder Laboratories, Chris Muzny director
Quantity | Value | Units | Method | Reference | Comment |
---|---|---|---|---|---|
Tboil | 461. | K | N/A | Colonge and Grenet, 1954 | Uncertainty assigned by TRC = 4. K |

Gas phase ion energetics data

Data compiled by: Sharon G. Lias, Rhoda D. Levin, and Sherif A. Kafafi
Ionization energy determinations
IE (eV) | Method | Reference |
---|---|---|
8.128 ± 0.005 | PE | Masclet, Grosjean, et al., 1973 |

References

Colonge and Grenet, 1954
Colonge, J.; Grenet, J.,
Bull. Soc. Chim. Fr., 1954, 1954, 1304. [all data]
Masclet, Grosjean, et al., 1973
Masclet, P.; Grosjean, D.; Mouvier, G.,
Alkene ionization potentials. Part I. Quantitative determination of alkyl group structural effects,
J. Electron Spectrosc. Relat. Phenom., 1973, 2, 225. [all data]