2,2,5-Trimethyl-3-(t-butyl)-3-hexene
- Formula: C13H26
- Molecular weight: 182.3455
- IUPAC Standard InChIKey: QAJPKKJZLRFSID-UHFFFAOYSA-N
- CAS Registry Number: 50787-12-7
- Chemical structure:
View 3d structure (requires JavaScript / HTML 5) - Permanent link for this species. Use this link for bookmarking this species for future reference.

Gas phase ion energetics data

Data compiled as indicated in comments:
LLK - Sharon G. Lias, Rhoda D. Levin, and Sherif A. Kafafi
Ionization energy determinations
IE (eV) | Method | Reference | Comment |
---|---|---|---|
8.307 ± 0.008 | PE | Masclet, Grosjean, et al., 1973 | LLK |

References

Masclet, Grosjean, et al., 1973
Masclet, P.; Grosjean, D.; Mouvier, G.,
Alkene ionization potentials. Part I. Quantitative determination of alkyl group structural effects,
J. Electron Spectrosc. Relat. Phenom., 1973, 2, 225. [all data]