Ethynylcyclobutane
- Formula: C6H8
- Molecular weight: 80.1277
- IUPAC Standard InChIKey: GAXSIWLVORHPTJ-UHFFFAOYSA-N
- CAS Registry Number: 50786-62-4
- Chemical structure:
View 3d structure (requires JavaScript / HTML 5) - Permanent link for this species. Use this link for bookmarking this species for future reference.

Gas phase ion energetics data

Data compiled as indicated in comments:
LLK - Sharon G. Lias, Rhoda D. Levin, and Sherif A. Kafafi
Ionization energy determinations
IE (eV) | Method | Reference | Comment |
---|---|---|---|
10.02 | PE | Bruckmann and Klessinger, 1978 | Vertical value; LLK |
10.02 | PE | Bruckmann and Klessinger, 1973 | Vertical value; LLK |

References

Bruckmann and Klessinger, 1978
Bruckmann, P.; Klessinger, M.,
Konjugative Wechselwirkungen des Cyclobutans,
Chem. Ber., 1978, 111, 944. [all data]
Bruckmann and Klessinger, 1973
Bruckmann, P.; Klessinger, M.,
Photoelektronenspektren organischer verbindungen. III. Photoelektronenspektren acetylensubstituierter kleiner ringe,
J. Electron Spectrosc. Relat. Phenom., 1973, 2, 341. [all data]