4,7-Methano-1H-indene,octahydro-8-methyl-,stereoisomer
- Formula: C11H18
- Molecular weight: 150.2606
- IUPAC Standard InChIKey: JIOAEIDAELDISL-UHFFFAOYSA-N
- CAS Registry Number: 50745-92-1
- Chemical structure:
View 3d structure (requires JavaScript / HTML 5) - Permanent link for this species. Use this link for bookmarking this species for future reference.

Gas phase ion energetics data

Data compiled by: Sharon G. Lias, Rhoda D. Levin, and Sherif A. Kafafi
Ionization energy determinations
IE (eV) | Method | Reference |
---|---|---|
9.35 ± 0.05 | PI | Fedorova, Denisov, et al., 1973 |
Appearance energy determinations
Ion | AE (eV) | Other Products | Method | Reference | Comment |
---|---|---|---|---|---|
C5H7+ | >10.5 ± 0.1 | ? | PI | Fedorova, Denisov, et al., 1973 | |
C6H9+ | 9.5 ± 0.1 | ? | PI | Fedorova, Denisov, et al., 1973 | |
C7H10+ | 9.5 ± 0.1 | ? | PI | Fedorova, Denisov, et al., 1973 | |
C8H13+ | 9.5 ± 0.1 | ? | PI | Fedorova, Denisov, et al., 1973 | |
C9H13+ | 9.5 ± 0.1 | ? | PI | Fedorova, Denisov, et al., 1973 | |
C10H15+ | 9.6 ± 0.1 | CH3 | PI | Fedorova, Denisov, et al., 1973 |

References

Fedorova, Denisov, et al., 1973
Fedorova, M.S.; Denisov, Y.V.; Poptapov, V.K.,
Mass-spectrometric study of the photoionisation processes of tricyclo[5,2,1,02,6] decane and its alkyl derivatives,
Russ. J. Phys. Chem., 1973, 47, 1498. [all data]